Life Science Identifier
type: Datatype
comment: persistent, location-independent, globally unique identifier for biological objects in the life sciences domain specified by OMG Life Sciences Research; LSID is represented as a Uniform Resource Name (URN)

FD_Table070 code
type: Datatype
comment: code in FD_Table070 used by EUR-Lex/CELLAR

Encoding level
type: Class
comment: the Encoding Level authority class provides values that indicates the fullness of the bibliographic information and/or content designation of the MARC record.
subclass of: Concept
equivalent class: Restriction
  has value: encoding-level
  on property: inScheme

United Nations Code for Trade and Transport Locations code
type: Datatype
comment: 5-character code where the first two characters are the ISO 3166 country codes while the remaining three are derived from Recommendation 16 from the UNECE in Geneva, together with Eurostat supplied codes for ports not yet included in the UN system

Requirement stage
type: Class
comment: this class describes when and whether a given requirement must be provided in a procedure.
subclass of: Concept
equivalent class: Restriction
  has value: requirement-stage
  on property: inScheme

Council code
type: Datatype
comment: code used by the Council of the European Union

FD_Table040 code
type: Datatype
comment: code in FD_Table040 used by EUR-Lex/CELLAR

PUB_THEM17 code
type: Datatype
comment: code in the PUB_THEM17 table, maintained by the Cataloguing team

Related country
type: ObjectProperty
comment: link to a related country or territory
domain: Concept
range: Concept
range includes: Country

Codification data
type: Datatype
comment: code used in several authority tables for codifying concepts in TED portal expert search and used in TED Schema (CODIF_DATA)

Reified change note
type: ObjectProperty
comment: reified version of the skos:changeNote
range: Note (reified SKOS note)
sub property of: Reified note

FD_Table613 code
type: Datatype
comment: code in FD_Table613 used by EUR-Lex/CELLAR

Office address
type: DatatypeProperty
comment: address of the office inside a given building
domain: Resource
range: Literal

Modification type
type: Class
comment: the Modification type class provides a list of modifications to a legal act resulting from the instructions in a modifying act or corrigendum. It is used by EUR-Lex and AKN4EU, among others.
subclass of: Concept
equivalent class: Restriction
  has value: modification-type
  on property: inScheme

Place
type: Class
comment: place class lists concepts associated with the localities of the world. It provides authority codes that are based on UN/LOCODE codes. Place uses the classification (membership classification) and the authority codes of the Countries and territories. Place also provides ISO 3166-2 codes, as well as geographical coordinates. The European capitals of culture are also included. The original name of each locality is indicated. Corporate body uses Place to identify the seat of each concept (LOC_id), and Site uses it to identify the location of each site (loc_code).
subclass of: Concept
equivalent class: Restriction
  has value: place
  on property: inScheme

FD_Table010 code
type: Datatype
comment: code in FD_Table010, no longer used by EUR-Lex/CELLAR

Info URI
type: Datatype
comment: identifier conforming to the Info URI scheme which enables identifiers from public namespaces to be represented as URIs when they would otherwise have no canonical URL form

Event order in a legal Process
type: DatatypeProperty
comment: Logical or chronological order of events involved in the legal decision-making process within the EU.
domain: Concept
range: integer
created: 2024-11-21T10:57:12
modified: 2024-11-29T09:10:13

Main activity
type: Class
comment: this class provides the list of main activities of the buyers.The codes associated with contracting authorities are derived from the top level of the Classification of the functions of the government (COFOG) from the United Nations Statistics Division.
subclass of: Concept
equivalent class: Restriction
  has value: main-activity
  on property: inScheme

Foreign Subsidy Measure Conclusion
type: Class
comment: on 12 July 2023, the Foreign Subsidies Regulation (FSR) (Regulation (EU) 2022/2560) entered into force. The FSR introduces a new set of rules that enables the Commission to address distortions caused by foreign subsidies. This allows the EU to ensure a level of playing field for all companies operating in the Single Market, while remaining open to trade and investment. This class is about the situation of Measures applied under the Foreign Subsidies Regulation (EU) 2022/2560. Economic operators bidding in large public procurement procedures must submit a notification or declaration pursuant to Article 28(1) FSR with their tender, which is assessed by the Commission. The economic operators either provide a notification or a declaration under the FSR, depending on the amount of foreign financial contribution received. The contract award notice must acknowledge the Commission’s assessment, based on the situations described in the class.
subclass of: Concept
equivalent class: Restriction
  has value: foreign-subsidy-measure-conclusion
  on property: inScheme

Textual format
type: DatatypeProperty
comment: indication on the textual format of the resource
domain: Concept
range: boolean
domain includes: File type

EU budget amount status
type: Class
comment: this class provides possible statuses for amounts in the EU budget. It has been developed specifically for the EU budget as Linked Open Data project.
subclass of: Concept
equivalent class: Restriction
  has value: eu-budget-amount-status
  on property: inScheme

Position type
type: Class
comment: This class provides the list of possible types of position of the staff employed by the EU institutions, bodies or agencies. It has been developed specifically for the EU budget as Linked Open Data project.
subclass of: Concept
equivalent class: Restriction
  has value: position-type
  on property: inScheme

Number threshold
type: Class
comment: this class provides the codes linked to the type of threshold values within the context of public procurement.
subclass of: Concept
equivalent class: Restriction
  has value: number-threshold
  on property: inScheme

Public event type
type: Class
comment: the public event type class defines public events that happen at a particular place and time, are organised by an agent for a particular purpose, and are of interest to a general audience. This definition excludes natural events such as earthquakes or hurricanes.
subclass of: Concept
equivalent class: Restriction
  has value: public-event-type
  on property: inScheme

Reified order
type: ObjectProperty
comment: current value and historical values of the numerical value giving the order of a resource
deprecated: true
scope note: This property aims to be used only into the WhoIsWho environment.

Formex code
type: Datatype
comment: code used in FORMEX, Formalized Exchange of Electronic Publications

PUB_ORDIN code
type: Datatype
comment: code in the PUB_ORDIN table, maintained by the Cataloguing team

COM internal consultation type
type: Class
subclass of: Concept
equivalent class: Restriction
  has value: com internal consultation type
  on property: inScheme

FD_Table330 code
type: Datatype
comment: code in FD_Table330 used by EUR-Lex/CELLAR

Activity type

Number weight
type: Class
comment: this class provides the codes linked to the type of weight values used in award criteria within the context of public procurement.
subclass of: Concept
equivalent class: Restriction
  has value: number-weight
  on property: inScheme

Data service type
type: Class
comment: the class provides possible types of data services.It has been developed specifically for the Linked Data Solutions (LDS) project.
subclass of: Concept
equivalent class: Restriction
  has value: data-service-type
  on property: inScheme

FD_Table607 code
type: Datatype
comment: code in FD_Table607 used by EUR-Lex/CELLAR

Licence
type: Class
comment: the Licence class lists the European Commission Reuse Notice and the European Union Public Licences. It also provides a list of standard licences available internationally, including the Creative Commons licences. It gives an authority code and labels in most official EU languages.
subclass of: Concept
equivalent class: Restriction
  has value: licence
  on property: inScheme

CVD contract type
type: Class
comment: the type of contract of the procurement procedure within the scope of Clean Vehicles Directive 2009/33/EC.
subclass of: Concept
equivalent class: Restriction
  has value: cvd-contract-type
  on property: inScheme

End date
type: DatatypeProperty
comment: date at which a resource is no longer valid
domain: Resource
range: date

ISO 639-1 code
type: Datatype
comment: two-letter code that has been designed to represent most of the major languages of the world

xml language
type: Datatype
comment: code indicating the natural language in which xml content is expressed; the code is based on ISO 639 codes and RFC 5646 explains how those codes are structured

Legal status
type: ObjectProperty
comment: legal status of a resource
domain: Concept
range: Concept
range includes: File status

Asset classification
type: Class
comment: this class is intended for organising knowledge organisation system (KOS) assets published by the Publications Office of the European Union ranging from controlled lists, terminologies, thesauri, models, markup schemas, ontologies and authoritative assets and other kinds of resources. The assets types are classified by their main function, being classification, sematic or data modelling, handling authoritative data,
subclass of: Concept
equivalent class: Restriction
  has value: asset-classification
  on property: inScheme

Subdivision position
type: Class
comment: the Subdivision position class provides the possible positions in the subdivisions of acts with the respective authority codes. These positions are used for the consolidation of legislation.
subclass of: Concept
equivalent class: Restriction
  has value: subdivision-position
  on property: inScheme

Event
type: Class
comment: event class lists the events that are part of the legal decision making process. It was created to harmonise and to trace historically the various events triggered by an agent within the procedures and associated with a resource type.
subclass of: Concept
equivalent class: Restriction
  has value: event
  on property: inScheme

ORCID identifier
type: Datatype
comment: non-proprietary persistent digital identifier that uniquely identifies researchers

OJ section code
type: Datatype
comment: code used to identify the section of the Official Journal

Media type (Eudor)
type: Datatype
comment: identifier for media types used in Eudor system; Eudor supports Idol, a central repository that holds indexed data

CELEX code
type: Datatype
comment: unique identifier of each document in EUR-Lex, regardless of language

ISO 3166-1 numeric code
type: Datatype
comment: three-digit country code defined in ISO 3166-1, part of the ISO 3166 standard published by the International Organization for Standardization (ISO), to represent countries, dependent territories, and special areas of geographical interest; ISO 3166-1 numeric codes are similar to the three-digit country codes developed and maintained by the United Nations Statistics Division, from which they originate in its UN M.49 standard.

Jurisdiction
type: ObjectProperty
comment: court or tribunal that has juridiction over a resource
domain: Concept
range: Concept
range includes: Court type

Reified target
type: ObjectProperty
comment: target of a semantic relationship reified by euvoc:XlSemanticRelation
domain: Semantic Relation (Deprecated)
range: Resource
deprecated: true
scope note: This property aims to be used only into the WhoIsWho environment.

Suborganisation of
type: ObjectProperty
comment: relation between an organisation and the current and hisorical values of org:hasSubOrganization
domain: Resource
range: Semantic Relation (Deprecated)
range includes: Organization
deprecated: true
scope note: This property aims to be used only into the WhoIsWho environment.

ISO 3166-2 code
type: Datatype
comment: code identifying the principal subdivisions (e.g. provinces or states) of all countries coded in ISO 3166-1

Citizenship
type: ObjectProperty
comment: citizenship of a person
domain: Concept
range: Concept
domain includes: EU political leader name
range includes: Country

Euvoc Ontology
type: Ontology
comment: Euvoc is the ontology published by the Publications Office of the European Union for the development of authority tables and corporate datasets. It contains a set of classes and specific properties that will enable all the information to be expressed and meet the needs of institutional or private users. Some of its elements have an essentially technical support purpose. Others are generic. To improve the compatibility of datasets using this ontology, constraints have been added directly, along with suggested uses.
contributor: Publications Office of the European Union
contributor: PUBL
creator: Publications Office of the European Union
creator: PUBL
issued: 2024-12-11
modified: 2024-12-02T09:59:01
publisher: PUBL
rights: https://creativecommons.org/licenses/by-nd/4.0/
rights holder: Publications Office of the European Union
rights holder: PUBL
title: Euvoc ontology
imports: org#
imports: terms
imports: core
imports: owl
imports: dcam
imports: skos-xl
version IRI: http://publications.europa.eu/ontology/euvoc#2.1
version info: 2.1

Linking ISSN
type: Datatype
comment: specific ISSN that groups the different media of the same serial publication; a single ISSN-L is designated for all media of a serial publication, irrespective of how many there are

Notation (reified SKOS notation)
type: Class
comment: current and historical values of skos:notation.
equivalent class: Restriction
  cardinality: 1
  on property: value

Organization type
type: Class
comment: the Organization type class lists various types of organisations.
subclass of: Concept
equivalent class: Restriction
  has value: organization-type
  on property: inScheme

OJ code
type: Datatype
comment: code used in the Official Journal

Non publication justification
type: Class
comment: this class provides codes and values for the main reasons for not immediately publishing a notice within the context of public procurement.
subclass of: Concept
equivalent class: Restriction
  has value: non-publication-justification
  on property: inScheme

Occur in procedure phase
type: ObjectProperty
comment: procedure phase of in which the event could occur
domain: Concept
range: Concept
domain includes: Event
range includes: Procedure phase

EU political leader name
type: Class
comment: EU political leader name class contains the current and previous members of the College of Commissioners. The members of the College are the Commission's political leadership.
subclass of: Concept
equivalent class: Restriction
  has value: political-leader
  on property: inScheme

TED Schema code
type: Datatype
comment: code used in the schema of Tenders Electronic Daily, the online version of the 'Supplement to the Official Journal of the European Union', dedicated to European public procurement

Local Resource Identifier
type: Datatype
comment: identifier generated by the resource identifier scheme that provides local resource identifiers that are unique in their local environment and understood by the person submitting the metadata

Count element
type: DatatypeProperty
comment: number of elements linked to the related resource
domain: Concept
range: integer
domain includes: Multilingual

Locality code
type: ObjectProperty
comment: locality associated to a resource
domain: Concept
range: Concept
range includes: Place

Applies to
type: ObjectProperty
comment: document to which the licence applies
domain: Concept
range: Concept
domain includes: Licence
range includes: Licence domain

Access right
type: Class
comment: the access right class provides the access rights or restrictions to resources. It is designed for but not limited to DCAT descriptions of datasets.
subclass of: Concept
equivalent class: Restriction
  has value: access-right
  on property: inScheme

ISO 15924 alpha-4 code
type: Datatype
comment: four-letter script code defined in ISO 15924 standard published by the International Organization for Standardization (ISO), to represent names of scripts; script is defined as ‘set of graphic characters used for the written form of one or more languages’

Handle identifier
type: Datatype
comment: identifier generated by the Handle System which allows secured name resolution and administration over the public Internet; it is unique and can be retained over long time periods; the scheme is described in the RFC 1737

Vehicle category
type: Class
comment: the category of vehicle falling within the scope of Directive 2009/33/EC.
subclass of: Concept
equivalent class: Restriction
  has value: vehicle-category
  on property: inScheme

Represents
type: ObjectProperty
comment: entity or function that a person or organisation represents
domain: Resource
range: Concept

Environmental impact
type: Class
comment: this class provides the information about whether a procurement includes a process to procure goods, services and works with a reduced environmental impact throughout their life cycle.
subclass of: Concept
equivalent class: Restriction
  has value: environmental-impact
  on property: inScheme

CJ code
type: Datatype
comment: code used by the Court of Justice

Official given name
type: DatatypeProperty
comment: name assigned at birth, as distinct from their family name
domain: Resource
range: string

File status
type: Class
comment: file status class outlines various stages in the life cycle of different activities. Originally, it detailed the different stages in the life cycle of an act (or in the decision-making process of an act) from initiation to completion, to meet the needs of EUR-Lex. As the need for a more generic status table arose, this asset was expanded to encompass stages for all kinds of products and processes.
subclass of: Concept
equivalent class: Restriction
  has value: file-status
  on property: inScheme

Reified notation
type: ObjectProperty
comment: relation between a resource and a Notation value
domain: Resource
range: Notation (reified SKOS notation)

Honorific
type: Class
comment: honorific class provides a list of honorific titles used in addressing or referring to a person as used in the EU Whoiswho.
subclass of: Concept
equivalent class: Restriction
  has value: honorific
  on property: inScheme

Context
type: ObjectProperty
comment: context in which a resource is intended to be used
domain: Resource
range: Resource

Role qualification
type: ObjectProperty
comment: type of position of a person
domain: Resource
range: Concept
range includes: Role qualifier

Applicable in procedure type
type: ObjectProperty
comment: procedure in which the event may apply
domain: Concept
range: Concept
domain includes: Event
range includes: Procedure nature

Internet Assigned Numbers Authority code
type: Datatype
comment: two-letter code for country-coded top-level domains in Internet addresses

Dissemination status
type: Class
comment: the Dissemination status authority class provides values for describing the status of dissemination for content, e.g. serials, monographic series, mobile applications, podcasts, datasets.
subclass of: Concept
equivalent class: Restriction
  has value: dissemination-status
  on property: inScheme

Award criterion type
type: Class
comment: this class provides the list of rules to be taken into account for the award decisions within the in public procurement procedures. The initial values are those foreseen in the public procurement directives of 2014 (Directives 2014/23/EU, 2014/24/EU and 2014/25/EU).
subclass of: Concept
equivalent class: Restriction
  has value: award-criterion-type
  on property: inScheme

Product form
type: Class
comment: the Product form class provides the various product forms published at the Publications Office, mainly those related to the general publications (brochures, leaflets, …), and the EU Open Data Portal (ODP).
subclass of: Concept
equivalent class: Restriction
  has value: product-form
  on property: inScheme

Carrier
type: Class
comment: the Carrier class lists values representing the medium on which content is stored.
subclass of: Concept
equivalent class: Restriction
  has value: carrier
  on property: inScheme

Subdivision
type: Class
comment: the Subdivision class provides the subdivisions of acts used for legal citations. It also lists the parts of the corrigenda. Subdivision is part of the Core Metadata used in the exchange between the institutions involved in the legal decision making process and the Publications Office of the European Union. It is used by Akoma Ntoso for EU, FORMEX, ELI and EUR-Lex for identifying divisions in a text. It provides an authority code and labels in all official EU languages.
subclass of: Concept
equivalent class: Restriction
  has value: subdivision
  on property: inScheme

Grammatical consciousness
type: Class
comment: the grammatical-consciousness class provides the grammatical features regarding consciousness of a substantive. It is designed to capture number form variations in the Irish language, used to enumerate human beings or things and animals.
subclass of: Concept
equivalent class: Restriction
  has value: grammatical-consciousness
  on property: inScheme

DOI prefix
type: Datatype
comment: first part of a DOI, composed of a directory indicator followed by a registrant code; the directory indicator is "10" and it distinguishes the entire set of character strings (prefix and suffix) as digital object identifiers within the resolution system; the second element of the DOI prefix is the registrant code, a unique string assigned to a registrant

Archival Resource Key
type: Datatype
comment: specially constructed, globally unique actionable URL that provides a naming scheme for persistent access to digital objects

ONIX code
type: Datatype
comment: code value from ONIX for Books

Grammatical number
type: Class
comment: the grammatical-number class provides the list of the grammatical numbers referring to different number of things or persons: "singular", "dual" or "plural". There is also a concept "generic" for forms that do not distinguish between grammatical numbers.
subclass of: Concept
equivalent class: Restriction
  has value: grammatical-number
  on property: inScheme

FD_Table325 code
type: Datatype
comment: code in FD_Table325, no longer used by EUR-Lex/CELLAR

OP catalogue number
type: Datatype
comment: internal identifier assigned to all works created by the Publications Office, used to categorise publications in catalogues and as an identification key in various IT applications

TED code
type: Datatype
comment: code used in Tenders Electronic Daily, the online version of the 'Supplement to the Official Journal of the European Union', dedicated to European public procurement

Procurement procedure type
type: Class
comment: this class provides a list of procurement procedures defined by law that lead to the conclusion of public contracts.
subclass of: Concept
equivalent class: Restriction
  has value: procurement-procedure-type
  on property: inScheme

Time period
type: Class
comment: the Time-period class lists the periods of time in the 24 official languages of the EU. It enumerates the names of the seasons, months, weekdays and the main units of time when the issues are published. It also contains concepts for ‘unlimited’ or ‘unknown’ time periods.
subclass of: Concept
equivalent class: Restriction
  has value: timeperiod
  on property: inScheme

Received submission type
type: Class
comment: this class provides the list of relevant categories used to classify tenders or requests to participate received within the context of public procurement.
subclass of: Concept
equivalent class: Restriction
  has value: received-submission-type
  on property: inScheme

Role
type: Class
comment: role class lists the roles of persons or entities relevant for the descriptive metadata used at the Publications Office and the core metadata used in the data exchange between the institutions involved in the legal decision-making process. Range of users also includes EU Publications and EUR-Lex. Role provides an authority code and start-use date of each concept and labels in all official EU languages.
subclass of: Concept
equivalent class: Restriction
  has value: role
  on property: inScheme

FD_Table608 code
type: Datatype
comment: code in FD_Table608 used by EUR-Lex/CELLAR

Country code
type: ObjectProperty
comment: country associated to any type of resource
domain: Resource
range: Concept
range includes: Country

LAM project properties
type: Datatype
comment: code in the LAM project properties catalogue maintained by Legal Analysis

FD_Table499 code
type: Datatype
comment: code in FD_Table499 used by EUR-Lex/CELLAR

EuroVoc code
type: Datatype
comment: code used in EU's multilingual thesaurus EuroVoc

Uniform Resource Name
type: Datatype
comment: URI that is assigned under the "urn" URI scheme and a particular URN namespace, with the intent that the URN will be a persistent, location-independent resource identifier

Subcontracting obligation
type: Class
comment: this class provides the list of codes and values used for the obligation of the economic operator of sharing parts of the original contract to third parties. The share may refer to the portion of work, services or supplies.
subclass of: Concept
equivalent class: Restriction
  has value: subcontracting-obligation
  on property: inScheme

Order method
type: DatatypeProperty
comment: method used to arrange the resources
domain: Resource
range: Literal

Resource type
type: Class
comment: resource type class lists the different types of documents (directive, regulation, etc.) used for the data exchange between the European institutions involved in the legal decision-making process. It was established to harmonise the various types of documents used by different systems, particularly in the ‘Core Metadata and Extension Metadata XML schemas’. Resource type is part of the Core Metadata and is used together with the Event and Corporate body (Agent) controlled vocabularies. Together, they define an event triggered by an agent associated with a resource type. The range of users has expanded beyond the core metadata parties.
subclass of: Concept
equivalent class: Restriction
  has value: resource-type
  on property: inScheme

Missing info submission
type: Class
comment: this class provides the list of codes indicating whether tenderer-related information (complete or partial) can be supplemented even after the submission deadline.
subclass of: Concept
equivalent class: Restriction
  has value: missing-info-submission
  on property: inScheme

Measurement unit
type: Class
comment: the Measurement unit class lists units of measurement with their authority codes. The labels and symbols are given in all official EU languages. If available, the codes are based on the code list recommendation N°. 20 "Codes for Units of Measure Used in International Trade" (as revised periodically) maintained and published by UNECE through its Center for Trade Facilitation and Electronic Business (UN/CEFACT).
subclass of: Concept
equivalent class: Restriction
  has value: measurement-unit
  on property: inScheme

Administrative center
type: ObjectProperty
comment: seat of administration of a territorial unit
domain: Concept
range: Concept
domain includes: Administrative territorial unit
range includes: Place

Grammatical gender
type: Class
comment: the grammatical-gender class provides the list of the grammatical genders in languages which have gender distinctions: "male", "female", "neuter" or "utrum". It also contains concepts for "no gender" (in languages that do not have gender distinctions) and "generic" (identical forms in languages that make gender distinctions).
subclass of: Concept
equivalent class: Restriction
  has value: grammatical-gender
  on property: inScheme

Legal date
type: Class
subclass of: Concept
equivalent class: Restriction
  has value: legal-date
  on property: inScheme

Numerical data
type: DatatypeProperty
comment: set the numerical value on the properties euvoc:xlOrder and euvoc:xlProtocolLevel
domain: Resource
range: integer
deprecated: true
scope note: This property aims to be used only into the WhoIsWho environment.

Bibliographic Reference Code
type: Datatype
comment: compact identifier used by several astronomical data systems to uniquely specify literature references (also known as 'refcode')

Notice type
type: Class
comment: this class provides a list of public procurement notices according to procurement legislation published once a project is approved.
subclass of: Concept
equivalent class: Restriction
  has value: notice-type
  on property: inScheme

Exclusion Ground
type: Class
comment: exclusion grounds in public procurement refer to the criteria that prevent certain entities from participating in public contracts due to criminal offenses, tax breaches, or other specified misconduct, aiming to ensure fairness and integrity in public procurement processes.
subclass of: Concept
equivalent class: Restriction
  has value: exclusion-ground
  on property: inScheme

Confidentiality level
type: Class
comment: the Confidentiality level class is used to define the information confidentiality levels according to the European Commission Security Notice ‘Information assessment and classification’, C(2019) 1903 final, 5.3.2019.
subclass of: Concept
equivalent class: Restriction
  has value: confidentiality-level
  on property: inScheme

Buyer legal type
type: Class
comment: this class provides a list of the the type of procuring authorities within the domain of public procurement according to legislation.
subclass of: Concept
equivalent class: Restriction
  has value: buyer-legal-type
  on property: inScheme

Economic operator size
type: Class
comment: this class provides the different categories in which the tenderers to whom a contract can be awarded are classified, according to their size (using as criteria the number of employees).
subclass of: Concept
equivalent class: Restriction
  has value: economic-operator-size
  on property: inScheme

Case report
type: Class
comment: the Case report class provides the different names of the case law reports of the Court of Justice of the European Union.
subclass of: Concept
equivalent class: Restriction
  has value: case-report
  on property: inScheme

Use context
type: Class
comment: the Use context class lists different applications and environments that make use of the various authority tables.
subclass of: Concept
equivalent class: Restriction
  has value: use-context
  on property: inScheme

ISO 3166-3 code
type: Datatype
comment: ISO 3166-3 is part of the ISO 3166 standard published by the International Organization for Standardization (ISO), and defines codes for country names which have been deleted from ISO 3166-1; each former country name in ISO 3166-3 is assigned a four-letter alphabetic code

Address type
type: Class
comment: this class provides the address types as used in the EU Whoiswho.
subclass of: Concept
equivalent class: Restriction
  has value: address-type
  on property: inScheme

CELEX sector code
type: Datatype
comment: code used to identify the sector, the first element (number or letter) of the CELEX code

FD_Table361 code
type: Datatype
comment: code in FD_Table361 used by EUR-Lex/CELLAR

Form type
type: Class
comment: this class provides the codes and values used for the type of forms published on TED.
subclass of: Concept
equivalent class: Restriction
  has value: form-type
  on property: inScheme

Documentation type
type: Class
comment: the Documentation type class provides possible documentation types.
subclass of: Concept
equivalent class: Restriction
  has value: documentation-type
  on property: inScheme

CELEX root code
type: Datatype
comment: code used to identify the root of a CELEX code

Semantic Relation (Deprecated)
type: Class
comment: current value and historical values of org:hasSubOrganization
deprecated: true

Change corrig justification
type: Class
comment: this class provides the codes and values used in case of justification of correction applied to a notice within the context of public procurement
subclass of: Concept
equivalent class: Restriction
  has value: change-corrig-justification
  on property: inScheme

Membership classification
type: Class
comment: the membership-classification class provides a list of politico-economic units for classifying countries, localities or languages. It focuses mainly on units with European relevance.
subclass of: Concept
equivalent class: Restriction
  has value: membership-classification
  on property: inScheme

FD_Table060 code
type: Datatype
comment: code in FD_Table060, no longer used by EUR-Lex/CELLAR

Reified editorial note
type: ObjectProperty
comment: reified version of the skos:editorialNote
range: Note (reified SKOS note)
sub property of: Reified note

Start date
type: DatatypeProperty
comment: date since which a resource is valid
domain: Resource
range: date

FD_Table030 code
type: Datatype
comment: code in FD_Table030 used by EUR-Lex/CELLAR

Contact point
type: ObjectProperty
comment: contact point of an entity
domain: Resource
range: Resource

Usage
type: Class
comment: this class provides the list of codes and values indicating the application of criteria or other concepts and information.
subclass of: Concept
equivalent class: Restriction
  has value: usage
  on property: inScheme

Document identifier format
type: Class
comment: document identifier format class describes the standardised syntax of the identifiers of documents produced by the institutions of the European Union in particular. It was created to be used by metadata in the AKN4EU mark-up language. It provides for each identifier marked a mapping with a standardised syntax with a decomposition into the subcomponents and for each subcomponent a meaning depending on the type of identifier. Each institution can have its own naming convention and is allowed to map it according to its own naming convention inside the text.
subclass of: Concept
equivalent class: Restriction
  has value: document-identifier-format
  on property: inScheme

Compressed format
type: DatatypeProperty
comment: indication on compressed format of the resource
domain: Concept
range: boolean
domain includes: File type

Uniform Resource Identifier
type: Datatype
comment: unique sequence of characters that identifies a logical or physical resource used by web technologies

Reified disclaimer
type: ObjectProperty
comment: relation between a resource and the current and historical values of a euvoc:disclaimer
range: Note (reified SKOS note)
sub property of: Reified note
modified: 2024-12-02T09:50:47

ISO 639-2 – bibliographic code
type: Datatype
comment: three-letter code that is derived from the English name for a language and gives more possible combinations, so ISO 639-2:1998 can cover more languages

Directory of EU legal acts
type: Class
comment: the Directory of EU legal acts class contains the directories of EU legislation (Directory of European Union legislation, Directory of European Union preparatory acts, Directory of international agreements and Directory of European Union consolidated acts) which facilitate the access to EU legislation by subject. The directory of EU legal acts is structured into 20 chapters with divisions into further sub-sections as necessary. The Directory of EU legal acts AT is part of the Core Metadata used in the exchange between the institutions involved in the legal decision making process and the Publications Office of the European Union. It indicates the authority code and start-use date of each concept and gives labels in all official EU languages.
subclass of: Concept
equivalent class: Restriction
  has value: dir-eu-legal-act
  on property: inScheme

Capital classification
type: Class
comment: capital classification is a class providing locality statuses.
subclass of: Concept
equivalent class: Restriction
  has value: capital-classification
  on property: inScheme

MNE code
type: Datatype
comment: code used by Procat for national transposing measures/mesures nationales de transposition

Applicability
type: Class
comment: this class provides a list of the options pertinent to be chosen for a matter concerning the applicability of predefined fields. It is designed for but not restricted to the context of public procurement.
subclass of: Concept
equivalent class: Restriction
  has value: applicability
  on property: inScheme

FD_Table380 code
type: Datatype
comment: code in FD_Table380 used by EUR-Lex/CELLAR

Writing system
type: Class
comment: the Writing system class provides the list of the main writing systems. They are differentiated depending on what a symbol represents inside the system.
subclass of: Concept
equivalent class: Restriction
  has value: writing-system
  on property: inScheme

Subcontracting indication
type: Class
comment: this class provides the list of codes and values used to indicate information regarding the share of parts of a contract to third parties. The share may refer to the portion of work, services or supplies and/or to the subject matter being subcontracted.
subclass of: Concept
equivalent class: Restriction
  has value: subcontracting-indication
  on property: inScheme

Case status
type: Class
comment: The Case status authority class provides the different statuses used for a case at the Court of Justice of the European Union.
subclass of: Concept
equivalent class: Restriction
  has value: case-status
  on property: inScheme

Dataset type
type: Class
comment: dataset type class lists types of datasets.
subclass of: Concept
equivalent class: Restriction
  has value: dataset-type
  on property: inScheme

Domain
type: ObjectProperty
comment: subject of a resource based on the EuroVoc domains
domain: Resource
range: Concept
domain includes: Domain

Product status
type: Class
comment: the Product status class provides possible statuses of a product.It has been developed specifically for the Linked Data Solutions (LDS) project.
subclass of: Concept
equivalent class: Restriction
  has value: product-status
  on property: inScheme

Currency
type: Class
comment: this class lists concepts associated with currencies and currency subunits. The concepts included are correlated with the ISO 4217 international standard.
subclass of: Concept
equivalent class: Restriction
  has value: currency
  on property: inScheme

Framework agreement
type: Class
comment: this class provides the list of codes to distinguish the different type framework agreement involved in a tender.
subclass of: Concept
equivalent class: Restriction
  has value: framework-agreement
  on property: inScheme

SDMX
type: Datatype
comment: code used in the Statistical Data and Metadata eXchange (SDMX)

Legally based on treaty
type: ObjectProperty
comment: treaty that establishes or governs a resource
domain: Concept
range: Concept
range includes: Treaty

International Standard Text Code
type: Datatype
comment: numbering system for the unique identification of text-based works; the term “work” can refer to any content appearing in conventional printed books, audio-books, static e-books or enhanced digital books, as well as content which might appear in a newspaper or journal

Planned availability
type: Class
comment: the Planned availability class specifies the planned availability of DCAT-AP defined resources, namely distribution, dataset and data service.
subclass of: Concept
equivalent class: Restriction
  has value: planned-availability
  on property: inScheme

Duration unit
type: ObjectProperty
comment: time span during which occurrences occur
domain: Concept
range: Resource
domain includes: Frequency

ISO 5218-2 code
type: Datatype
comment: code for the representation of human sexes through a language-neutral single-digit code

Regularity
type: Class
comment: the Regularity class provides values for describing the publisher’s intention on the regularity of a given continuing resource. The concepts are based on MARC 21 Format for Bibliographic Data and MARC 21 codes are given as a mapping.
subclass of: Concept
equivalent class: Restriction
  has value: regularity
  on property: inScheme

EAN 13 code
type: Datatype
comment: thirteen-digit product identification code, the most widely used commercial distribution code in the world; it is managed by GS1, an international agency located in Brussels

EU Whoiswho identifier
type: Datatype
comment: identifier used in the EU Whoiswho, an electronic directory of managers and services in the EU institutions, bodies and agencies

Remedy type
type: Class
comment: this class describes the measures taken following a review.
subclass of: Concept
equivalent class: Restriction
  has value: remedy-type
  on property: inScheme

IATE code
type: Datatype
comment: code used in IATE, Inter-Active Terminology for Europe

PUB_DIV code
type: Datatype
comment: code in the PUB_DIV table, maintained by the Cataloguing team

PUB_BIND code
type: Datatype
comment: code in the PUB_BIND table, maintained by the Cataloguing team

FD_Table609 code
type: Datatype
comment: code in FD_Table609 used by EUR-Lex/CELLAR

FundRef identifier
type: Datatype
comment: identifier for an organisation that funds research; it is assigned by Crossref and maintained in its global FundRef registry

Strategic priority
type: Class
comment: the Strategic priority authority class lists concepts that indicate strategic priorities of an institution. It was created for listing the strategic priorities 2019-2024 of the European Commission, but it can be used to list the strategic priorities of all institutions. The class provides the name, authority code, start-use date and definition of each concept.
subclass of: Concept
equivalent class: Restriction
  has value: strategic-priority
  on property: inScheme

Script
type: Class
comment: the Script class lists concepts associated with distinctive scripts. Its main scope is to support activities associated with publication process. The concepts included are correlated with the ISO 15924 international standard. Each script is instantiated according to a writing system, described in writing-system authority table.
subclass of: Concept
equivalent class: Restriction
  has value: script
  on property: inScheme

ISO 639-3 code
type: Datatype
comment: three-letter code which aims to give as complete a listing of languages as possible, including living, extinct and ancient languages

International Road Transport code
type: Datatype
comment: code used in distinguishing signs of vehicles in international traffic

PUB_THEM14 code
type: Datatype
comment: code in the PUB_THEM14 table, maintained by the Cataloguing team

Treaty
type: Class
comment: the Treaty authority table class lists the different EU treaties, including treaties and protocols, accession treaties, Schengen Convention and Charter of Fundamental Rights. The Treaty class is part of the Core Metadata used in the exchange between the institutions involved in the legal decision-making process and the Publications Office of the European Union. It is also used by EUR-Lex. It provides an authority code, the start-use date of the concept and labels in all official EU languages.
subclass of: Concept
equivalent class: Restriction
  has value: treaty
  on property: inScheme

Legal proceeding result
type: Class
comment: this class presents concepts relating to the results of a case or procedure following the delivery of the decision. They are to be used together with the table of proceedings. More detailed information can be consulted in the Rules of Procedure of these courts, available on the website of the Court of Justice of the European Union: Rules of Procedure of the Court of Justice (18-6-2013): http://curia.europa.eu/jcms/upload/docs/application/pdf/2012-10/rp_en.pdf Rules of Procedure of the General Court (1-7-2013): http://curia.europa.eu/jcms/upload/docs/application/pdf/2008-09/txt7_2008-09-25_14-08-6_431.pdf Rules of Procedure of the European Union Civil Service Tribunal (1-7-2011): http://curia.europa.eu/jcms/upload/docs/application/pdf/2010-04/rp_14_04_2010_en.pdf These concepts are used for the production of reports of cases before the Court and to publish the case-law on the EUR-Lex site: http://eur-lex.europa.eu/collection/eu-law/eu-case-law.html
subclass of: Concept
equivalent class: Restriction
  has value: procresult
  on property: inScheme

FD_Table610 code
type: Datatype
comment: code in FD_Table610 used by EUR-Lex/CELLAR

Distribution type
type: Class
comment: this class provides possible distribution types.
subclass of: Concept
equivalent class: Restriction
  has value: distribution-type
  on property: inScheme

Administrative territorial unit
type: Class
comment: administrative territorial unit (ATU) class lists concepts associated with various administrative territorial units of current and past EU Member States. An administrative territorial unit is a portion of a country or other region delineated for the purpose of administration. Due to the large volume of lowest level administrative units (local authority, municipality) in certain countries, these units have not yet been fully implemented. ATU is structured by countries and contains labels in the official language(s) of the concerned country and in English.
subclass of: Concept
equivalent class: Restriction
  has value: atu
  on property: inScheme

Media type (Cellar)
type: Datatype
comment: identifier used in Cellar for media types; Cellar is the common data repository of the Publications Office of the European Union

Position status
type: Class
comment: this class provides the position status of the staff employed by the EU institutions, bodies or agencies as used in the EU Whoiswho.
subclass of: Concept
equivalent class: Restriction
  has value: position-status
  on property: inScheme

ISBN registrant element
type: Datatype
comment: ISBN element that identifies the particular publisher or imprint

arXiv identifier
type: Datatype
comment: identifier generated by ArXiv, an open access repository and distribution server for electronic preprints featuring, in particular, physics, mathematics, computer science, nonlinear sciences, quantitative biology, quantitative finance, statistics, electrical engineering and systems science and economics

FD_Table290 code
type: Datatype
comment: code in FD_Table290 used by EUR-Lex/CELLAR

International Standard Book Number code
type: Datatype
comment: product identifier used by publishers, booksellers, libraries, internet retailers and other supply chain participants for ordering, listing, sales records and stock control purposes; the ISBN identifies the registrant as well as the specific title, edition and format; ISBN is an International Standard that is published by ISO

IENI collection
type: Datatype
comment: identifier used in the collection (“IENI collection”) of acts related to the Ireland and Northern Ireland, based on the Protocol annexed to the Agreement on the withdrawal of the United Kingdom of Great Britain and Northern Ireland

Number fixed
type: Class
comment: this class provides the codes linked to fix values within the context of public procurement.
subclass of: Concept
equivalent class: Restriction
  has value: number-fixed
  on property: inScheme

Transport service
type: Class
comment: this class provides a list of transport services.
subclass of: Concept
equivalent class: Restriction
  has value: transport-service
  on property: inScheme

Continent
type: Class
comment: the continent class provides a list of continents
subclass of: Concept
equivalent class: Restriction
  has value: continent
  on property: inScheme

Strategic procurement
type: Class
comment: this class provides the information about whether a procurement aims to reduce environmental impact, fulfil social objectives and/or buy innovative works, supplies or services. These conditions are achieved via either technical specifications, selection criteria, award criteria and contract terms.
subclass of: Concept
equivalent class: Restriction
  has value: strategic-procurement
  on property: inScheme

File type
type: Class
comment: file type class lists different types of digital files.
subclass of: Concept
equivalent class: Restriction
  has value: file-type
  on property: inScheme

Licence domain
type: Class
comment: the Licence domain class provides a list of domains. All values are used for encoding the classification of licences in the Licence class.
subclass of: Concept
equivalent class: Restriction
  has value: licence-domain
  on property: inScheme

Minidoc code
type: Datatype
comment: code used in the system Minidoc of the Court of Justice

Legal act domain
type: Class
comment: the Legal act domain class lists the various abbreviations of domains such as EC, EU, Euratom and CFSP, representing the sphere of action of the European Union and its predecessors, and used for numbering of EU legal acts.
subclass of: Concept
equivalent class: Restriction
  has value: legal-act-domain
  on property: inScheme

Human sex
type: Class
comment: the Human sex class provides the list of human sexes.
subclass of: Concept
equivalent class: Restriction
  has value: human-sex
  on property: inScheme

ISO 4217 numeric code
type: Datatype
comment: three-digit currency codes defined in ISO 4217 standard published by the International Organization for Standardization (ISO), to represent currencies and funds

Organisation subrole
type: Class
comment: this class provides the list of the different sub-functions of the organisations in a procurement procedure.
subclass of: Concept
equivalent class: Restriction
  has value: organisation-subrole
  on property: inScheme

Publisher Item Identifier
type: Datatype
comment: alphanumeric string of characters using a pre-existing ISSN or ISBN; it uniquely identifies an article and can be used for future cataloging, searching, and electronic retrieval

PUB_TARGET code
type: Datatype
comment: code in the PUB_TARGET table, maintained by the Cataloguing team

Position complement
type: DatatypeProperty
comment: element complementing the position of a resource
domain: Resource
range: Literal

Semantic technology
type: Class
comment: the Semantic technology class provides possible technologies used in the semantic web.It has been developed specifically for the Linked Data Solutions (LDS) project. It uses the acronyms of the technologies as preferred labels as these technologies are more known by the acronyms than by their long labels. The concepts are linked to their respective standards, specifications or recommendations.
subclass of: Concept
equivalent class: Restriction
  has value: semantic-technology
  on property: inScheme

International Standard Name Identifier
type: Datatype
comment: ISO certified global standard number for identifying the millions of contributors to creative works and those active in their distribution, including researchers, inventors, writers, artists, visual creators, performers, producers, publishers, aggregators, and more

Review decision type
type: Class
comment: this class describes the decision made a review body.
subclass of: Concept
equivalent class: Restriction
  has value: review-decision-type
  on property: inScheme

Irregularity type
type: Class
comment: this class refers generally to the types of irregularities described in Section 2 of the Annex to the Commission Decision C(2019) 3452.
subclass of: Concept
equivalent class: Restriction
  has value: irregularity-type
  on property: inScheme

PUB_GMD code
type: Datatype
comment: code in the PUB_GMD table, maintained by the Cataloguing team

Court type
type: Class
comment: the Court type class provides the classification of EU courts as well as the general three-level classification of national courts.
subclass of: Concept
equivalent class: Restriction
  has value: court-type
  on property: inScheme

PUB_FREQ code
type: Datatype
comment: code in the PUB_FREQ table, maintained by the Cataloguing team

Publication theme
type: Class
comment: this class provides the various themes used for the general publications.
subclass of: Concept
equivalent class: Restriction
  has value: pub-theme
  on property: inScheme

Frequency
type: Class
comment: frequency provides the occurrences of various events, actions and publications, including the intervals at which a continuing resource is issued.
subclass of: Concept
equivalent class: Restriction
  has value: frequency
  on property: inScheme

OP_MARC21
type: Datatype
comment: MARC21-related value used for cataloguing

Legal proceeding
type: Class
comment: the Legal proceeding authority class presents concepts relating to different legal remedies available to an applicant before the EU Courts (Articles 260, 263, 268 and 270 of the Treaty on the Functioning of the European Union). The Legal proceeding class is used together with the Legal proceeding result (procresult) class. The Legal proceeding class provides an authority code and the start-use date of each concept and labels in all official EU languages. The concepts are used for the production of reports of cases before the Court and to publish the case-law on the EUR-Lex site.
subclass of: Concept
equivalent class: Restriction
  has value: procjur
  on property: inScheme

Disclaimer
type: AnnotationProperty
comment: statement that disclaims liability or responsibility of a resource
range: langString
sub property of: note
modified: 2024-12-02T09:50:03

PUB_LOC code
type: Datatype
comment: code in the PUB_LOC table, maintained by the Cataloguing team

Organisation role
type: Class
comment: this table provides the list of the different functions of the organisations in a procurement procedure.
subclass of: Concept
equivalent class: Restriction
  has value: organisation-role
  on property: inScheme

PUB_CORP code
type: Datatype
comment: code in the PUB_CORP table, maintained by the Cataloguing team

Social objective
type: Class
comment: this class provides the values linked to any social objective promoted by the technical specifications, award criteria, selection criteria or contract performance conditions included in a procurement.
subclass of: Concept
equivalent class: Restriction
  has value: social-objective
  on property: inScheme

Country calling code
type: Datatype
comment: telephone number prefix for reaching telephone subscribers in the networks of the member countries or regions of the International Telecommunication Union (ITU); country codes are a component of the international telephone numbering plan, and are necessary only when dialing a telephone number to establish a call to another country; country codes are dialed before the national telephone number

Official family name
type: DatatypeProperty
comment: name of a person, as distinct from their given name
domain: Resource
range: string

Treaty classification
type: Class
comment: the treaty-classification class lists the types of treaties of the European Union and its predecessors. The class provides an authority code and the start-use date of each concept.
subclass of: Concept
equivalent class: Restriction
  has value: treaty-classification
  on property: inScheme

Internal procedure
type: Class
comment: internal procedure is a class that lists the various internal procedures of the institutions involved in the legislative process.
subclass of: Concept
equivalent class: Restriction
  has value: internal-procedure
  on property: inScheme

Licence version
type: DatatypeProperty
comment: version of the concerned licence
domain: Concept
range: Literal
domain includes: Licence

Legal basis
type: Class
comment: this class provides the legal basis based on the legal acts used for a given public procurement procedure.
subclass of: Concept
equivalent class: Restriction
  has value: legal-basis
  on property: inScheme

Permission
type: Class
comment: This class provides the codes linked to the different values of permission and/or obligation.
subclass of: Concept
equivalent class: Restriction
  has value: permission
  on property: inScheme

TRANSLIT_MARC21 code
type: Datatype
comment: MARC21-related value used for cataloguing

FD_Table140 code
type: Datatype
comment: code in FD_Table140, no longer used by EUR-Lex/CELLAR

Cultural city
type: DatatypeProperty
comment: year during which a place was designated as European Capital of Culture
domain: Concept
range: gYear
domain includes: Place

Interinstitutional procedure
type: Class
comment: the Interinstitutional procedure class lists the different procedures used in the context of data exchange between the institutions involved in the legal decision-making process and the Publications Office of the European Union. It provides an authority code, the start-use date of the concept and labels in all official EU languages.
subclass of: Concept
equivalent class: Restriction
  has value: procedure
  on property: inScheme

Contract detail
type: Class
comment: this class provides a framework to represent data relating to procurement
subclass of: Concept
equivalent class: Restriction
  has value: contract-detail
  on property: inScheme

Has sub organization
type: ObjectProperty
comment: relation between an organisation and the current and hisorical values of org:hasSubOrganization
domain: Resource
range: Semantic Relation (Deprecated)
domain includes: Organization
deprecated: true
scope note: This property aims to be used only into the WhoIsWho environment.

FD_Table110 code
type: Datatype
comment: code in FD_Table110 used by EUR-Lex/CELLAR

PUB_DIME code
type: Datatype
comment: code in the PUB_DIME table, maintained by the Cataloguing team

Subject matter
type: Class
comment: subject matter class shows the concepts used for the indexation of notices published on EUR-Lex. It has been extended to show the concepts that provide the legal framework of the European Central Bank and the Protocol on Ireland/Northern Ireland. The newest extension is Themes in focus. Subject matter is part of the Core Metadata used in the exchange between the institutions involved in the legal decision making process and the Publications Office of the European Union. The subject matter classification exists in parallel with two other classifications: the Directory of European Union Legislation and EuroVoc. Differently from these, the subject matter classification is strictly aligned with the evolution of the European Union policies cited in the different treaties of the European Union that can be consulted at: http://eur-lex.europa.eu/collection/eu-law/treaties.html?locale=en
subclass of: Concept
equivalent class: Restriction
  has value: subject-matter
  on property: inScheme

Digital Object Identifier
type: Datatype
comment: permanent identifier given to an electronic document; similar to a URN, but in contrast to a URL, it is not dependent upon the electronic document's location

ISO 4217 code
type: Datatype
comment: code identifying currencies and funds organised in the following lists: current currency and funds code, current funds codes, codes for historic denominations of currencies and funds

EP code
type: Datatype
comment: code used by the European Parliament

PUB_PHYS code
type: Datatype
comment: code in the PUB_PHYS table, maintained by the Cataloguing team

Accessibility
type: Class
comment: this class provides a list of options for the use of accessibility criteria for person with disabilities in the technical specifications within the domain of public procurement.
subclass of: Concept
equivalent class: Restriction
  has value: accessibility
  on property: inScheme

DPS usage
type: Class
comment: this class provides a list whether a dynamic purchasing system is involved in a procurement and, in case of central purchasing bodies, whether it can be used by buyers not listed in the notice of the Official Journal of the European Union.
subclass of: Concept
equivalent class: Restriction
  has value: dps-usage
  on property: inScheme

Responsibility of
type: ObjectProperty
comment: entity that asssumes the responsabilities associated to the resource
domain: Concept
range: Concept
domain includes: Concept
range includes: Corporate body

Green Public Procurement Criteria
type: Class
comment: this class provides the information about whether a procurement procedure includes the use of established green public procurement criteria (selection criteria, technical specifications, award criteria and contract performance clauses), at national, Union or other levels, if applicable.
subclass of: Concept
equivalent class: Restriction
  has value: gpp-criteria
  on property: inScheme

Position status
type: ObjectProperty
comment: element giving the status of a given position
domain: Resource
range: Concept
range includes: Position status

Administrative territorial unit type
type: Class
comment: administrative territorial unit class provides the various types of administrative territorial units within the Member States of the European Union. It is linked to the controlled vocabulary Administrative territorial unit, which provides the list of the subdivisions per country. The categorisation of these types is based on official national information and the Committee of the Regions of the European Union has provided the translations in all official languages of the European Union. The ISO 3166-2 standard has also been used. Where there are differences between the typesof administrative units and the ISO code, the legal basis of the country concerned has taken precedence. An administrative unit is defined for administrative purposes with a certain degree of autonomy and is country-specific. The administrative unit refers to the public administration to which administrative law applies.
subclass of: Concept
equivalent class: Restriction
  has value: atu-type
  on property: inScheme

Reified history note
type: ObjectProperty
comment: reified version of the skos:historyNote
range: Note (reified SKOS note)
sub property of: Reified note

PubMed Central Identifier
type: Datatype
comment: bibliographic identifier assigned by the National Library of Medicine to each full-text paper in PubMed Central, a free archive of biomedical and life sciences journal literature; also known as 'PMC reference number'

FD_Table375 code
type: Datatype
comment: code in FD_Table375 used by EUR-Lex/CELLAR

Non award justification
type: Class
comment: this class provides the list of reasons of the buyer for not choosing a winner in the procurement procedure.
subclass of: Concept
equivalent class: Restriction
  has value: non-award-justification
  on property: inScheme

Machine readable
type: DatatypeProperty
comment: resource that is capable of being interpretable by a machine
domain: Concept
range: boolean
domain includes: File type

File extension
type: Datatype
comment: suffix to the name of a computer file; the extension indicates a characteristic of the file contents or its intended use

ISO 639-2 – terminological code
type: Datatype
comment: three-letter code that is derived from the native name for the language and resembles the language's two-letter code in ISO 639-1; it gives more possible combinations, so ISO 639-2:1998 can cover more languages

FD_Table400 code
type: Datatype
comment: code in FD_Table400 used by EUR-Lex/CELLAR

Illustrative content
type: Class
comment: the Illustrative content class provides values describing the illustrative content that supplements the textual content.
subclass of: Concept
equivalent class: Restriction
  has value: illustrative-content
  on property: inScheme

Reified scope note
type: ObjectProperty
comment: reified version of the skos:scopeNote
range: Note (reified SKOS note)
sub property of: Reified note

Eudor language code
type: Datatype
comment: code used in Eudor system for languages; Eudor supports Idol, a central repository that holds indexed data

Order
type: DatatypeProperty
comment: arrangement of resources according to a specific sequence or priority
domain: Resource
range: Literal

ESPD code
type: Datatype
comment: code used in the European Single Procurement Document (ESPD)

Organisation type
type: ObjectProperty
comment: value of a Type when reified in the class euvo:XlType used to keep historical value of a type
domain: Resource
range: Concept
range includes: Organization type
deprecated: true
scope note: This property aims to be used only into the WhoIsWho environment.

FD_Table050 code
type: Datatype
comment: code in FD_Table050 used by EUR-Lex/CELLAR

PUB_LNGISO code
type: Datatype
comment: code in the PUB_LNGISO table, maintained by the Cataloguing team

Managed by
type: ObjectProperty
comment: site associated to a resource
domain: Concept
range: Concept
domain includes: Site
range includes: Corporate body

Review body type
type: Class
comment: this class covers the list of organisations providing the review of a given procedure.
subclass of: Concept
equivalent class: Restriction
  has value: review-body-type
  on property: inScheme

ISO 3166-1 alpha-2 code
type: Datatype
comment: two-letter country code defined in ISO 3166-1, part of the ISO 3166 standard published by the International Organization for Standardization (ISO), to represent countries, dependent territories, and special areas of geographical interest

FD_Table020 code
type: Datatype
comment: code in FD_Table020, no longer used by EUR-Lex/CELLAR

Classification
type: ObjectProperty
comment: relation between a resource and the historical values of org:classification
domain: Resource
range: Resource
range includes: Corporate body classification

Modification justification
type: Class
comment: this class provides the main reasons for modifying a contract within the domain of public procurement.
subclass of: Concept
equivalent class: Restriction
  has value: modification-justification
  on property: inScheme

Signature location
type: ObjectProperty
comment: place where a resource was signed
domain: Concept
range: Concept
domain includes: Treaty
range includes: Place

Concept status
type: Class
comment: this class provides the various statuses used in a harmonized way amongst the various tables (NALs).
subclass of: Concept
equivalent class: Restriction
  has value: concept-status
  on property: inScheme

PUB_QUAL code
type: Datatype
comment: code in the PUB_QUAL table, maintained by the Cataloguing team

Physical dimension
type: Class
comment: physical dimension class provides values that describe the sizes of printing paper used or the actual physical size of a bibliographic item.
subclass of: Concept
equivalent class: Restriction
  has value: physical-dimension
  on property: inScheme

Role qualifier
type: Class
comment: the Role qualifier class serves as a subset or refinement of the Role controlled vocabulary. This code list can be used as a pick list to refine the various roles of persons or entities in detail.
subclass of: Concept
equivalent class: Restriction
  has value: role-qualifier
  on property: inScheme

Event status
type: Class
comment: the Event status authority table (AT) is a controlled vocabulary that describes the status of an event in an interinstutional procedure or an internal procedure of an institution allowing therefore to distinguish aspects of the same (legal) event in time: usually events are post-factum (NORMAL), but they can be PROJECTED to happen in the future or - if that projection was revoked by the projecting stakeholder - CANCELLED. Another projection aspect is setting up a DEADLINE from another event.
subclass of: Concept
equivalent class: Restriction
  has value: event-status
  on property: inScheme

Selection criterion
type: Class
comment: this class provides the list of conditions that are concerned for evaluation purposes. In the domain of public procurement, selection criteria are normally based on a specific legal framework. This is a subset of the ESPD codelist CriterionTaxonomy.
subclass of: Concept
equivalent class: Restriction
  has value: selection-criterion
  on property: inScheme

EU budget stage
type: Class
comment: this class provides possible stages of the EU budget preparatory actions and pilot projects. It has been developed specifically for the EU budget as Linked Open Data project.
subclass of: Concept
equivalent class: Restriction
  has value: eu-budget-stage
  on property: inScheme

Role nature
type: Class
comment: role nature class provides a list of values used for encoding the attribution of roles in the Role controlled vocabulary. It is thus a technical authority table. Labels are available in English and in French.
subclass of: Concept
equivalent class: Restriction
  has value: role-nature
  on property: inScheme

Correction status
type: Class
comment: this class provides proofreading statuses of labels and descriptions.
subclass of: Concept
equivalent class: Restriction
  has value: correction-status
  on property: inScheme

Reified note
type: ObjectProperty
comment: current and historical value of a note
range: Note (reified SKOS note)

Procedure phase
type: Class
comment: the Procedure phase authority class lists phases of various decisional processes. It was originally created for AKN4EU specifications concerning documents pertaining to the ordinary legislative procedure, but it can be used for other purposes in the future, as a reference for phases of procedures of all nature – non legislative, legislative, internal, interinstitutional and judicial. It is part of the exchange between the institutions involved in the legal decision making process and the Publications Office of the European Union. It provides an authority code and the start-use date and a definition of each concept.
subclass of: Concept
equivalent class: Restriction
  has value: procedure-phase
  on property: inScheme

United Nations Statistics Division M49 code
type: Datatype
comment: standard country or area codes for statistical purposes, developed and maintained by the United Nations Statistics Division (UNSD); each area code is a three-digit number which can refer to a wide variety of geographical, political, or economic regions, like a continent, a country or a specific group of countries; codes assigned in the system generally do not change when the country or area's name changes (unlike ISO 3166-1 alpha-2 or ISO 3166-1 alpha-3), but instead change when the territorial extent of the country or area changes significantly

PlanJO code
type: Datatype
comment: code used by PlanJO, the internal workflow system used for the legal acts and documents published in the Official Journal L and C

Currency
type: ObjectProperty
comment: currency associated to any type of resource
domain: Resource
range: Concept
domain includes: EU programme
range includes: Currency

Legislative priority
type: Class
comment: the Legislative priority class lists legislative priorities that are agreed between the European Parliament, the Council and the Commission in the joint declarations on legislative priorities.
subclass of: Concept
equivalent class: Restriction
  has value: legislative-priority
  on property: inScheme

Legal proceeding type
type: Class
comment: this class provides the three different types of legal proceedings at the Court of Justice.
subclass of: Concept
equivalent class: Restriction
  has value: procjur-type
  on property: inScheme

European Case Law Identifier code
type: Datatype
comment: uniform identifier that has the same recognizable format for all Member States and EU courts; the European Case Law Identifier (ECLI) has been developed to facilitate the correct and unequivocal citation of judgments from European and national courts

Non proprietary extension
type: DatatypeProperty
comment: non proprietary file extension
domain: Concept
range: boolean
domain includes: File type

Notation type
type: Class
comment: the Notation type class lists the notation types used in the controlled vocabularies and in the context of DCAT-AP (a specification based on W3C Data Catalogue vocabulary).
subclass of: Concept
equivalent class: Restriction
  has value: notation-type
  on property: inScheme

Criterion
type: Class
comment: this class provides criteria used for public procurement procedures.
subclass of: Concept
equivalent class: Restriction
  has value: criterion
  on property: inScheme

Subdivision content
type: Class
comment: the Subdivision content class lists concepts that indicate specific content of text divisions. It was created by the Publications Office for the development of AKN4EU specifications, which concern documents exchanged between the EU Institutions involved in the legal decision making process and sent to the Publication Office for publication. It provides the name, authority code, start-use date and definition of each concept.
subclass of: Concept
equivalent class: Restriction
  has value: subdivision-content
  on property: inScheme

Litige code
type: Datatype
comment: code used in the system Litige of the Court of Justice

Package format
type: DatatypeProperty
comment: indication on the package format of the resource
domain: Concept
range: boolean
domain includes: File type

Official journal date
type: DatatypeProperty
comment: date on which the resource was published in any Official Journal
domain: Concept
range: date
domain includes: Treaty

Customer service
type: Class
comment: this class provides a list of customer services.
subclass of: Concept
equivalent class: Restriction
  has value: customer-service
  on property: inScheme

Target audience age group
type: Class
subclass of: Concept
equivalent class: Restriction
  has value: target-audience-age-group
  on property: inScheme

Electronic ISSN
type: Datatype
comment: ISSN for the online edition of a journal; this is to enable librarians and other users to distinguish between their print and online holdings

International Standard Serial Number
type: Datatype
comment: eight-digit number which identifies all periodical publications as such, including electronic serials; each ISSN assigned to a serial publication is registered in an international database: the ISSN Register – the most comprehensive and authoritative source for the identification of serial publications world-wide

Dataset status
type: Class
comment: the Dataset status class provides possible statuses for datasets.
subclass of: Concept
equivalent class: Restriction
  has value: dataset-status
  on property: inScheme

Media type (IANA)
type: Datatype
comment: media type assigned by IANA, the Internet Assigned Numbers Authority

Label type
type: Class
comment: the Label type class provides the various forms of labels that are considered alternative labels in the SKOS format.
subclass of: Concept
equivalent class: Restriction
  has value: label-type
  on property: inScheme

Number
type: Class
comment: The Number class lists a set of cardinal and ordinal numbers in the 24 official languages of the EU. It is mainly used for numbering the issues. It contains numbers from 1 to 31, decimals from 40 to 100 and some bigger round numbers. In addition to a reference either to CAR (cardinal) or ORD (ordinal), the authority code contains the number itself.
subclass of: Concept
equivalent class: Restriction
  has value: number
  on property: inScheme

Document used in Public Procurement
type: Class
comment: this class describes documents used in Public Procurement. A set of interrelated business information representing the business facts and associated metadata. The information may be conveyed in any language, medium or form, including textual, numerical, graphic, cartographic, audio-visual forms, etc.
subclass of: Concept
equivalent class: Restriction
  has value: document-used-in-public-procurement
  on property: inScheme

Procurement of innovation
type: Class
comment: this class provides the codes and values used for innovative works, supplies or services being bought.
subclass of: Concept
equivalent class: Restriction
  has value: innovative-acquisition
  on property: inScheme

Corporate body
type: Class
comment: corporate body class provides the varying names of EU corporate bodies for a given time period; international and national corporate bodies are also included as far as they are used in the various systems in the Publications Office.
subclass of: Concept
equivalent class: Restriction
  has value: corporate-body
  on property: inScheme

Data theme
type: Class
comment: the Data theme class lists concepts associated with themes used for dataset classification. Its main scope is to support activities associated with the Data Catalog Vocabulary application profile (DCAT-AP).
subclass of: Concept
equivalent class: Restriction
  has value: data-theme
  on property: inScheme

EU Bookshop code
type: Datatype
comment: code used by the EU Bookshop

PUB_NOT code
type: Datatype
comment: code in the PUB_NOT table, maintained by the Cataloguing team

Pégase code
type: Datatype
comment: code in Pégase, an application managed by the Secretariat-General of the European Commission which allows to encode different information concerning the interinstitutional procedures with the aim to feed information systems such as SG Vista and Prelex

Legacy authority code
type: Datatype
comment: mnemonic denotation of a concept used in authority tables

PUB_LANG code
type: Datatype
comment: code in the PUB_LANG table, maintained by the Cataloguing team

PubMed Identifier
type: Datatype
comment: unique identifier number assigned to each article record entering PubMed, index of the biomedical literature; PMIDs are not reused after records are deleted

Codification
type: DatatypeProperty
comment: notation value
domain: Notation (reified SKOS notation)
range: Literal
is replaced by: value
deprecated: true
scope note: This property aims to be used only into the WhoIsWho environment.

NUTS
type: Datatype
comment: code used in the Nomenclature of territorial units for statistics (NUTS)

FD_Table557 code
type: Datatype
comment: code in FD_Table557 used by EUR-Lex/CELLAR

Official journal series
type: DatatypeProperty
comment: series of the Official Journal in which the resource was published
domain: Concept
range: string
domain includes: Treaty

EU programme
type: Class
comment: the EU programme class provides the list of programmes created and coordinated by the European Union and financially supported by the European Union or, in a few cases, by the contributions from the Member States. It has been developed specifically for the EU Budget as open linked data project. It indicates the authority code and start-use date of each concept and gives labels in all official EU languages.
subclass of: Concept
equivalent class: Restriction
  has value: eu-programme
  on property: inScheme

FD_Table612 code
type: Datatype
comment: code in FD_Table612 used by EUR-Lex/CELLAR

Reified protocol level
type: ObjectProperty
comment: current value and historical values of the protocol-level
domain: Resource
range: Numerical data
deprecated: true
scope note: This property aims to be used only into the WhoIsWho environment.

Language
type: Class
comment: language class lists world languages and language varieties, including sign languages. Its main purpose is to support activities associated with the publication process. The full set of languages contains more than 8000 language varieties, each identified by a code equivalent to the ISO 639-3 code. Concepts are aligned with the ISO 639 international standard, which is issued in several parts: ISO 639-1 contains strictly two alphabetic letters (alpha-2), ISO 639-2/B (B = bibliographic) is used for bibliographic purpose (alpha-3), ISO 639-2/T (T = terminology) is used for technical purpose (alpha-3), ISO 639-3 covers all the languages and macro-languages of the world (alpha-3); the values are compliant with ISO 639-2/T.
subclass of: Concept
equivalent class: Restriction
  has value: language
  on property: inScheme

Contract nature
type: Class
comment: this class provides a list of different types of subjects and goods that can be acquired by means of a public contract such as works, supplies and services by one or more contracting authorities from economic operators.
subclass of: Concept
equivalent class: Restriction
  has value: contract-nature
  on property: inScheme

Meeting
type: Class
comment: the Meeting class lists meetings that are described and/or required by interinstitutional procedures or the rules of procedure of an institutional stakeholder. It was created to provide canonical labels in 24 languages and a set of parametrized labels that serve as templates to be completed with actual metadata (e.g. number of the meeting, date of the meeting, corporate body holding the meeting) to form the title of a specific meeting instance.
subclass of: Concept
equivalent class: Restriction
  has value: meeting
  on property: inScheme

Grammatical alternation
type: Class
comment: the grammatical-alternation class captures the phonological alternations based on whether the first letter of the succeeding word is a consonant or a vowel, completed with a syllable rule. It is used for number forms in the Maltese language.
subclass of: Concept
equivalent class: Restriction
  has value: grammatical-alternation
  on property: inScheme

Protocol level
type: DatatypeProperty
comment: arrangement of resources according to the protocol level
domain: Resource
range: integer

Procedure nature
type: Class
comment: the Procedure nature class provides a classification of procedures applicable to the adoption of legislation and other acts by the institutions of the European Union as defined by the treaties. It provides an authority code, the start-use date and a description for each concept.
subclass of: Concept
equivalent class: Restriction
  has value: procedure-nature
  on property: inScheme

Reserved procurement
type: Class
comment: this class provides the values used to indicate whether the participation in the procurement is reserved for specific organisations.
subclass of: Concept
equivalent class: Restriction
  has value: reserved-procurement
  on property: inScheme

Persistent URL
type: Datatype
comment: URL that is guaranteed by an organization to function for a long period of time

Summaries of EU legislation classification
type: Class
comment: the Summaries of EU legislation classification class provides the classification used in the summaries of EU legislation and introductory texts.
subclass of: Concept
equivalent class: Restriction
  has value: class-sum-leg
  on property: inScheme

Target audience
type: Class
comment: target audience class lists the target audiences used for the general publications.
subclass of: Concept
equivalent class: Restriction
  has value: target-audience
  on property: inScheme

ISO 3166-1 alpha-3 code
type: Datatype
comment: three-letter country code defined in ISO 3166-1, part of the ISO 3166 standard published by the International Organization for Standardization (ISO), to represent countries, dependent territories, and special areas of geographical interest

COMREF code
type: Datatype
comment: code in COMREF, the European Commission's Human Resources Database

Document reference content type
type: Class
comment: this class lists the different types of reference documents related to the ESPD procurement procedure and in the case of notices whether they have been published at national, regional or European level.
subclass of: Concept
equivalent class: Restriction
  has value: docrefcontent-type
  on property: inScheme

Akoma Ntoso for European Union
type: Datatype
comment: this concept identifies the Akoma Ntoso common XML schema. It is developed under the governance of the Interinstitutional Metadata and Formats Committee (IMFC). The specifications are based on the generic Akoma Ntoso standard maintained by OASIS but tailored to the requirements that the EU Institutions define for their legal documents.

Event type
type: DatatypeProperty
comment: description that indicates the specific type of an event
domain: Concept
range: string
domain includes: Event

Decimal place
type: DatatypeProperty
comment: position of a digit to the right of a decimal point in a number
domain: Concept
range: integer
domain includes: Currency

Publication accessibility
type: Class
comment: the Publication accessibility class provides a list of terms describing assistive features and/or adaptations to improve the accessibility of publications for particular needs of some audiences.
subclass of: Concept
equivalent class: Restriction
  has value: publication-accessibility
  on property: inScheme

Resource status
type: ObjectProperty
comment: status of a resource
domain: Resource
range: Concept
range includes: Concept status

IBAN country code
type: Datatype
comment: two-letter country code (ISO 3166-1 alpha-2) used in the International Bank Account Number (IBAN) system; an IBAN consists of up to 34 alphanumeric characters comprising a country code, two check digits, and a number that includes the domestic bank account number, branch identifier, and potential routing information

ISO 15924 numeric code
type: Datatype
comment: three-digit script code defined in ISO 15924 standard published by the International Organization for Standardization (ISO), to represent names of scripts; script is defined as ‘set of graphic characters used for the written form of one or more languages’

ISG country code
type: Datatype
comment: country code used in the Interinstitutional Style Guide

Reified object
type: ObjectProperty
comment: object of a semantic relationship reified by euvoc:XlSemanticRelation
domain: Semantic Relation (Deprecated)
range: Resource
deprecated: true
scope note: This property aims to be used only into the WhoIsWho environment.

Other place service
type: Class
comment: this class provides the broad geopolitical areas linked to the location of works and the place of performance or delivery within the context of public procurement.
subclass of: Concept
equivalent class: Restriction
  has value: other-place-service
  on property: inScheme

DEMED code
type: Datatype
comment: code used by the DEMED system

ODP code
type: Datatype
comment: code used in the EU Open Data Portal

Country
type: Class
comment: countries and territories class lists concepts associated with names of countries and territories. It is a corporate reference data asset covered by the Corporate Reference Data Management policy of the European Commission. It provides codes and names of geospatial and geopolitical entities in all official EU languages and is the result of a combination of multiple relevant standards, created to serve the requirements and use cases of the EU institutions services. Its main scope is to support documentary metadata activities. The codes of the concepts included are correlated with the ISO 3166 international standard. The authority code relies where possible on the ISO 3166-1 alpha-3 code. Additional user-assigned alpha-3 codes have been used to cover entities that are not included in the ISO 3166-1 standard. The corporate list contains mappings with the ISO 3166-1 two-letter codes, the Interinstitutional Style Guide codes and with other internal and external identifiers including ISO 3166-1 numeric, ISO 3166-3, UNSD M49, UNSD Geoscheme, IBAN, TIR, IANA domain. For the names of countries and territories, the corporate list synchronises with the Interinstitutional Style Guide (ISG, Section 7.1 and Annexes A5 and A6) and with the IATE terminology database. Membership and classification properties provide possibilities to group concepts, e.g., UN, EU, EEA, EFTA, Schengen area, Euro area, NATO, OECD, UCPM, ENP-EAST, ENP-SOUTH, EU candidate countries and potential candidates.
subclass of: Concept
equivalent class: Restriction
  has value: country
  on property: inScheme

Note (reified SKOS note)
type: Class
comment: current and historical values of skos:note
equivalent class: Restriction
  cardinality: 1
  on property: value

Serial Item and Contribution Identifier
type: Datatype
comment: variable length code (ANSI/NISO standard Z39.56), an add-on to the ISSN that provides unique identification of serial issues (SII) and serial contributions (SCI)

Uniform Resource Locator
type: Datatype
comment: reference to a resource that specifies its location on a computer network and a mechanism for retrieving it; a URL is a specific type of Uniform Resource Identifier (URI)

FD_Table160 code
type: Datatype
comment: code in FD_Table160, no longer used by EUR-Lex/CELLAR

Corporate body classification
type: Class
comment: corporate body classification class provides types of corporate bodies.
subclass of: Concept
equivalent class: Restriction
  has value: corporate-body-classification
  on property: inScheme

Correction status
type: ObjectProperty
comment: correction status of a resource
domain: Resource
range: Concept
domain includes: Correction status

Winner selection status
type: Class
comment: this class provides the list of codes and values used to indicate whether a tenderer was chosen to be awarded with a contract and whether the competition is open.
subclass of: Concept
equivalent class: Restriction
  has value: winner-selection-status
  on property: inScheme

Official journal number
type: DatatypeProperty
comment: number of the Official Journal in which the resource was published
domain: Concept
range: Literal
domain includes: Treaty

FD_Table100 code
type: Datatype
comment: code in FD_Table100 used by EUR-Lex/CELLAR

Position grade
type: Class
comment: This table provides the function groups and grades of the staff employed by the European institutions, bodies or agencies. Officials and temporary agents are classed into function groups according to the nature of their duties: administrator (AD), assistant (AST), Secretary and clerk (AST/SC). - The AD function group comprises 12 grades corresponding to management, planning and research, scientific and linguistic functions; - The AST function group comprises 11 grades which correspond to executive and technical functions; - The AST/SC function group, comprises 6 grades which correspond to secretarial and clerical functions. Contract staff is subdivided into four function groups corresponding to the duties to be performed. Each function group is subdivided into grades. - Function group IV comprises grade 13 to 18 and preform administrative, advisory, linguistic and equivalent technical tasks, performed under the supervision of officials or temporary staff. - Function Group III comprises grade 8 to 12 and preform executive tasks, drafting, accountancy and other equivalent technical tasks, performed under the supervision of officials or temporary staff. - Function group II comprises grade 4 to 7 and preform clerical and secretarial tasks, office management and other equivalent tasks, performed under the supervision of officials or temporary staff. - Function group I comprises grade 1 to 3 and preform manual and administrative support service tasks, performed under the supervision of officials or temporary staff. The legal framework is provided in the Staff Regulations of Officials (EUSR), ANNEX 1 "Types of posts in each function group, as provided for in Article 5(4)" (https://eur-lex.europa.eu/legal-content/EN/TXT/PDF/?uri=CELEX:01962R0031-20200101) and the Conditions of Employment of Other Servants of the European Economic Community and the European Atomic Energy Community (CEOS). The grading of Contract Agents and Auxiliary Contract Agents is regulated in Article 80…
subclass of: Concept
equivalent class: Restriction
  has value: position-grade
  on property: inScheme

Multilingual
type: Class
comment: Multilingual class lists concepts associated with cataloguing to support activities related to the publication process. The concepts included are correlated with the need to identify different multilingual language combinations. The EU publications use two-character codes, the first two positions of the three-character controlled vocabulary. The codes are alphanumeric in order to avoid confusion with ISO language codes, which are strictly alphabetical.
subclass of: Concept
equivalent class: Restriction
  has value: multilingual
  on property: inScheme

Communication justification
type: Class
comment: this class provides the justification for restricting access rights to resources within the context of public procurement.
subclass of: Concept
equivalent class: Restriction
  has value: communication-justification
  on property: inScheme

NIH Manuscript Submission Identifier
type: Datatype
comment: identifier used to identify publications which have been initially submitted into the NIH Manuscript Submission System for eventual deposit in PubMed Central; once the web version of the publication is approved for inclusion in PMC and the corresponding citation is in PubMed, the article will also be assigned a PMCID

Site
type: Class
comment: the Site authority class provides the sites occupied by the various EU institutions and bodies.
subclass of: Concept
equivalent class: Restriction
  has value: site
  on property: inScheme

Universal Product Code
type: Datatype
comment: widely-used standard for barcodes; the barcode consists of a series of variable-width vertical bars and was created for tracking merchandise in stores, mainly at the point of sale

Formation of the Court
type: Class
comment: the Formation of the Court class shows the composition of the courts of the European Union according to the case they are seized with (Articles 251, 254 and 257 of the Treaty on Functioning of the European Union (TFEU). This class provides an authority code, the start-use date of the concept and labels in all official EU languages. The concepts are used for the production of reports of cases before the Court and to publish case-law on the EUR-Lex site.
subclass of: Concept
equivalent class: Restriction
  has value: formjug
  on property: inScheme

Number type
type: Class
comment: the Number type class provides the grammatical distinctions of numerals. The grammar distinguishes between cardinal and ordinal numbers.
subclass of: Concept
equivalent class: Restriction
  has value: number-type
  on property: inScheme

COM internal event
type: Class
comment: the COM internal event class is a technical class for the internal use of the European Commission.
subclass of: Concept
equivalent class: Restriction
  has value: com internal event
  on property: inScheme

Binding type
type: Class
comment: the Binding type class lists methods used to bind a published or unpublished document.
subclass of: Concept
equivalent class: Restriction
  has value: binding-type
  on property: inScheme

Open Citation Identifier
type: Datatype
comment: globally unique persistent identifier for bibliographic citations; within the OpenCitations Corpus, these bibliographic resource identifiers are unique, and every citation recorded in OCC has an OCI

Media type (Cellar manifestation)
type: Datatype
comment: identifier used in Cellar for manifestations of media types; Cellar is the common data repository of the Publications Office of the European Union

Named authority code
type: Datatype
comment: human-readable official identifier of a concept

United Nations Statistics Division geoscheme
type: Datatype
comment: regional grouping of countries and territories according to the United Nations geoscheme system (created by UNSD for statistical convenience and does not imply any assumption regarding political or other affiliation of countries or territories); the 'UNSD geoscheme' notation uses two levels of this classification: the intermediate region name is used whenever it is available, in other cases the broader level, subregion, is used

Reified example
type: ObjectProperty
comment: specific case or instance that illustrates or examplifies a resource
range: Note (reified SKOS note)
sub property of: Reified note

Direct award justification
type: Class
comment: this class provides the list of reasons for using a procedure which allows awarding contracts directly without the requirement of publishing a call for competition in the Official Journal of the European Union.
subclass of: Concept
equivalent class: Restriction
  has value: direct-award-justification
  on property: inScheme

FD_Table365 code
type: Datatype
comment: code in FD_Table365 used by EUR-Lex/CELLAR

Reified position complement
type: ObjectProperty
comment: actual and historical values of the position complemment
domain: Resource
range: Note (reified SKOS note)
deprecated: true
scope note: This property aims to be used only into the WhoIsWho environment.

Distribution status
type: Class
comment: the Distribution status class is used to define the status of distributions of datasets described using the DCAT-AP data model.
subclass of: Concept
equivalent class: Restriction
  has value: distribution-status
  on property: inScheme

Adjectival form
type: ObjectProperty
comment: indicates the relation between the adjectival form and a noun.
domain: Label
range: Label
deprecated: true

FD_Table335 code
type: Datatype
comment: code in FD_Table335 used by EUR-Lex/CELLAR

COM internal procedure
type: Class
comment: COM internal procedure class lists the procedures used inside the European Commission.
subclass of: Concept
equivalent class: Restriction
  has value: com internal procedure
  on property: inScheme

EU budget status
type: Class
comment: this class provides possible statuses of the EU budget preparatory actions and pilot projects. It has been developed specifically for the EU budget as Linked Open Data project.
subclass of: Concept
equivalent class: Restriction
  has value: eu-budget-status
  on property: inScheme

FD_Table601 code
type: Datatype
comment: code in FD_Table601 used by EUR-Lex/CELLAR

Reified definition
type: ObjectProperty
comment: relation between a resource and the current and historical values of a skos:definition
range: Note (reified SKOS note)
sub property of: Reified note
modified: 2024-12-02T09:29:24