EURIO: EUropean Research Information Ontology
type: Ontology
version IRI: v2.4#
creator: Publications Office of the European Commission
contributor: NTT Data
contributor: Cognizone
description: The EUropean Research Information Ontology (EURIO) conceptualises, formally encodes and makes available in an open, structured and machine-readable format data about research projects funded by the EU's framework programmes for research and innovation.
publisher: Publications Office of the European Commission
license: https://creativecommons.org/licenses/by/4.0/
modified: 2023-09-28
preferred namespace prefix: eurio
comment: CORDIS is the portal responsible for publishing the results of EU-funded research and innovation projects. EURIO (EUropean Research Information Ontology) is the conceptual data model developed by the Publications Office of the European Commission to represent and structure the CORDIS content in a semantic format improving its transparency, reusability and accessibility.
version info: v2.4

disburses
type: ObjectProperty
inverse of: is disbursed by
domain: Funding Agency
range: Grant
comment: Relates the funding agency to the grant(s) that it disburses.

employs
type: ObjectProperty
inverse of: is employed by
domain: Organisation
range: Person Role
comment: Relates the organisation to the role representing a person that the organisation employs during a project in which both participate.

funds
type: ObjectProperty
inverse of: is funded by
domain: Grant
range: Project
comment: Relates the grant with the project(s) that are completely or partially funded by it.

has acronym
type: ObjectProperty
inverse of: is acronym of
range: Acronym
comment: Relates an entity (e.g. project, grant, etc.) with its acronym(s). This includes acronyms representing the entity’s title as well as any additional acronyms extracted from other attributes of the entity.

has address
type: ObjectProperty
domain: Site
range: Postal Address
comment: Relates a physical location to its registered address.

has associated funding scheme
type: ObjectProperty
range: Funding Scheme
comment: Relates an entity other than funding scheme (e.g., result, etc.) with associated funding schemes.

has beneficiary
type: ObjectProperty
inverse of: is beneficiary of
domain: Grant
range: Role
comment: Relates the grant to the organisation or person role(s) that are a beneficiary of the grant.

has contact details
type: ObjectProperty
range: Contact Point
comment: Relates the role to the contact details of the entity taking the role (person or organisation) which are valid during the project of which the role forms a part.

has coordinates
type: ObjectProperty
domain: Site
range: Coordinates
comment: The geo-coordinates of a place

has EU country code
type: ObjectProperty
domain: Country
range: Concept
comment: The country code of the location or address according to the EU country codes.

has EuroSciVoc classification
type: ObjectProperty
domain: Project
range: Concept
comment: One or more values from the EuroSciVoc taxonomy that represent the main fields of science of the project.

has funding amount
type: ObjectProperty
domain: Class
  union of: Funding Scheme
  union of: Grant
range: Monetary Amount
comment: Relates the grant or funding scheme to the amount of money available for funding.

has funding scheme
type: ObjectProperty
inverse of: has grant
domain: Grant
range: Funding Scheme
comment: Relates the grant to the funding scheme of which the grant forms a part.

has funding scheme call
type: ObjectProperty
sub property of: has funding scheme
domain: Grant
range: Funding Scheme
comment: Indicates the Call under which a project has been funded.

has funding scheme category
type: ObjectProperty
domain: Funding Scheme
range: Concept
comment: A list of terms specifying the different categories / types of funding schemes.

has funding scheme programme
type: ObjectProperty
sub property of: has funding scheme
domain: Grant
range: Funding Scheme
comment: Indicates the legal basis under which a project has been funded.

has funding scheme topic
type: ObjectProperty
sub property of: has funding scheme
domain: Grant
range: Funding Scheme
comment: Indicates the Topic under which a project has been funded.

has funding scheme type
type: ObjectProperty
sub property of: has funding scheme
domain: Grant
range: Funding Scheme
comment: Indicates the type of action under which a project has been funded.

has geographical location
type: ObjectProperty
domain: Site
range: Administrative Area
comment: The basic containment relation between a place and one that contains it

has grant
type: ObjectProperty
domain: Funding Scheme
range: Grant
comment: Relates a funding scheme with the grants that form part of it.

has ISO country code
type: ObjectProperty
domain: Country
range: Concept
comment: The 2-digit ISO country code.

has involved party
type: ObjectProperty
inverse of: is involved in
domain: Project
range: Role
comment: Relates the Project to the roles that are involved in the project.

has NUTS 0 code
type: ObjectProperty
sub property of: has NUTS code
domain: Administrative Area
range: Concept
comment: A value representing the NUTS-0 code of the place or address.

has NUTS 1 code
type: ObjectProperty
sub property of: has NUTS code
domain: Administrative Area
range: Concept
comment: A value representing the NUTS-1 code of the place or address.

has NUTS 2 code
type: ObjectProperty
sub property of: has NUTS code
domain: Administrative Area
range: Concept
comment: A value representing the NUTS-2 code of the place or address.

has NUTS 3 code
type: ObjectProperty
sub property of: has NUTS code
domain: Administrative Area
range: Concept
comment: A value representing the NUTS-3 code of the place or address.

has NUTS code
type: ObjectProperty
domain: Administrative Area
range: Concept
comment: A value representing the NUTS code of the place or address.

has next funding scheme
type: ObjectProperty
domain: Funding Scheme
range: Funding Scheme
comment: Relates a funding scheme with the next funding scheme.

has payment
type: ObjectProperty
inverse of: is payment of
domain: Grant
range: Grant Payment
comment: Relates the grant to its payment(s).

has payment amount
type: ObjectProperty
domain: Grant Payment
range: Monetary Amount
comment: Relates the payment to the amount of money that was given to the beneficiary of the payment.

has previous funding scheme
type: ObjectProperty
domain: Funding Scheme
range: Funding Scheme
comment: Relates a funding scheme with the previous funding scheme.

has recipient
type: ObjectProperty
inverse of: is recipient of
domain: Grant Payment
range: Role
comment: Relates the grant payment to the organisation or person role(s) which have received the grant payment. Inverse property of isRecipientOf.

has related project
type: ObjectProperty
type: SymmetricProperty
domain: Project
range: Project
comment: Represents a generic non parent-child relation between two CORDIS projects.

has related scheme
type: ObjectProperty
type: SymmetricProperty
domain: Funding Scheme
range: Funding Scheme
comment: Represents a generic non parent-child relation between two funding schemes.

has result
type: ObjectProperty
inverse of: is result of
domain: Class
  union of: Project
range: Result
comment: Relates the project with its result(s).

has result type
type: ObjectProperty
domain: Result
range: Concept
comment: A list of terms specifying the types of results that can have a project.

has role
type: ObjectProperty
inverse of: is role of
domain: Class
  union of: Organisation
  union of: Person
range: Role
comment: Relates the person/organisation to the roles that the person/organisation takes.

has site
type: ObjectProperty
domain: Organisation
range: Site
comment: relates an organisation to its physical site

has sub-organisation
type: ObjectProperty
inverse of: is sub-organisation of
domain: Organisation
range: Organisation
comment: Relates the organisation with another organisation which is a sub-part or child of it.

has subscheme
type: ObjectProperty
inverse of: is subscheme of
domain: Funding Scheme
range: Funding Scheme
comment: Relates the funding scheme to its sub-schemes.

has total cost
type: ObjectProperty
domain: Project
range: Monetary Amount
comment: Relates the project with the amount of money expected, required, or given in payment for the project.

has unit
type: ObjectProperty
inverse of: is unit of
domain: Organisation
range: Organisation Unit
comment: Relates the organisation with a unit or department that forms part of the organisation.

implements
type: ObjectProperty
inverse of: is implemented by
domain: Funding Agency
range: Funding Scheme
comment: Relates a funding agency to the funding schemes that it implements and administers.

is acronym of
type: ObjectProperty
domain: Acronym
comment: Relates the acronym to the entity or entities to which it belongs.

is beneficiary of
type: ObjectProperty
domain: Role
range: Grant
comment: Relates the role to the grant(s) of which the role is a beneficiary.

is disbursed by
type: ObjectProperty
domain: Grant
range: Funding Agency
comment: Relates the grant to the funding agency that disburses the grant.

is employed by
type: ObjectProperty
domain: Person Role
range: Organisation
comment: Relates the person role to the organisation in which the person holding the role is employed during the project.

is funded by
type: ObjectProperty
domain: Project
range: Grant
comment: Relates the project with the grant(s) that completely or partially fund the project.

is implemented by
type: ObjectProperty
domain: Funding Scheme
range: Funding Agency
comment: Relates the funding scheme with the funding agency that implements and administers the scheme.

is involved in
type: ObjectProperty
domain: Role
range: Project
comment: Relates the role to the Project in which it is involved.

is payment of
type: ObjectProperty
domain: Grant Payment
range: Grant
comment: Relates a payment to the grant of which it is a part.

is recipient of
type: ObjectProperty
domain: Role
range: Grant Payment
comment: Relates the organisation or person role with the grant payment(s) which they have received. Inverse property of hasRecipient.

is result of
type: ObjectProperty
domain: Result
range: Class
  union of: Project
comment: Relates the results with the Project(s) involved.

is role of
type: ObjectProperty
domain: Role
range: Class
  union of: Organisation
  union of: Person
comment: Relates the person/organisation role to the person/organisation which assumes the role.

is site of
type: ObjectProperty
domain: Site
range: Organisation
comment: Indicates an entity which has presence at the given site

is sub-organisation of
type: ObjectProperty
domain: Organisation
range: Organisation
comment: Relates the organisation with another organisation of which it is a sub-part.

is subscheme of
type: ObjectProperty
domain: Funding Scheme
range: Funding Scheme
comment: Relates the funding scheme to its parent scheme of which this funding scheme forms a part.

is unit of
type: ObjectProperty
domain: Organisation Unit
range: Organisation
comment: Relates the unit to the organisation of which the unit forms a part.

refers to
type: ObjectProperty
domain: Acronym
comment: The entity to which this acronym refers. This can either be an entity inside of the knowledge graph or an external entity of any type.

abstract
type: DatatypeProperty
range: string
comment: The general summary and ideas of a CORDIS entity, e.g., project, result.

additional name
type: DatatypeProperty
domain: Person
range: string
comment: An additional name for a Person, can be used for a middle name.

address country
type: DatatypeProperty
domain: Postal Address
range: string
comment: The country of the place or address. You can also provide the two-letter ISO 3166-1 alpha-2 country code.

address locality
type: DatatypeProperty
domain: Postal Address
range: string
comment: The locality, town or city of the place or address.

author list
type: DatatypeProperty
range: string
comment: The list of authors.

code
type: DatatypeProperty
type: FunctionalProperty
domain: Funding Scheme
range: string
comment: A CORDA code.

currency
type: DatatypeProperty
domain: Monetary Amount
range: string
comment: The currency in which the monetary amount is expressed.

date
type: DatatypeProperty
range: date
comment: The date in which the grant payment took place.

definition
type: DatatypeProperty
domain: Acronym
range: string
comment: The definition of the acronym.

description
type: DatatypeProperty
range: string
comment: A brief summary of the entity (project, etc.).

doi
type: DatatypeProperty
type: FunctionalProperty
range: anyURI
comment: The digital object identifier of a publication.

duration
type: DatatypeProperty
range: nonNegativeInteger
comment: The period of time an entity (e.g. project, grant, etc.) has taken, represented as number of months.

email
type: DatatypeProperty
domain: Contact Point
range: anyURI
comment: Email address.

end date
type: DatatypeProperty
sub property of: date
range: date
comment: The date on which an entity (e.g. project, grant, etc.) is finalized or ceases to exist.

family name
type: DatatypeProperty
domain: Person
range: string
comment: The family name (last name) of the person.

fax number
type: DatatypeProperty
domain: Contact Point
range: Literal
comment: The fax number.

final results
type: DatatypeProperty
domain: Project Report Summary
range: string
comment: A brief description of the project findings.

full address
type: DatatypeProperty
domain: Postal Address
range: Literal
comment: The full address of a physical location of an entity.

given name
type: DatatypeProperty
domain: Person
range: string
comment: The given name (first name) of the person.

honorific title
type: DatatypeProperty
domain: Person
range: string
comment: An honorific prefix preceding a Person's name such as Dr, Mrs, Mr.

identifier
type: DatatypeProperty
type: FunctionalProperty
range: Literal
comment: The internal CORDA identifier.

is net
type: DatatypeProperty
domain: Monetary Amount
range: boolean
comment: Represents whether the monetary amount has deducted taxes or not.

isbn
type: DatatypeProperty
type: FunctionalProperty
domain: Project Publication
range: Literal
comment: The international standard book number of book publications.

issn
type: DatatypeProperty
type: FunctionalProperty
domain: Project Publication
range: Literal
comment: The international standard serial number of journal publications.

journal number
type: DatatypeProperty
domain: Project Publication
range: Literal
comment: The journal number of a published result.

journal title
type: DatatypeProperty
domain: Project Publication
range: string
comment: The title of the journal of a published result.

keyword
type: DatatypeProperty
range: string
comment: Word or words that represent the main idea of a referred entity (e.g., project. project result, etc.)

latitude
type: DatatypeProperty
domain: Coordinates
range: decimal
comment: The latitude of a location. For example 37.42242 (WGS 84).

legal name
type: DatatypeProperty
domain: Organisation
range: string
comment: The official name of the organization, e.g. the registered company name.

longitude
type: DatatypeProperty
domain: Coordinates
range: decimal
comment: The longitude of a location. For example -122.08585 (WGS 84).

name
type: DatatypeProperty
range: string
comment: The name of an entity

period number
type: DatatypeProperty
domain: Project Report Summary
range: integer
comment: The number of the reporting period.

post office box number
type: DatatypeProperty
domain: Postal Address
range: Literal
comment: The post office box number for PO box addresses.

postal code
type: DatatypeProperty
domain: Postal Address
range: Literal
comment: The postal code of the place or address.

project status
type: DatatypeProperty
domain: Project
range: Datatype
  one of: CANCEL
  one of: CLOSED
  one of: ONGOING
  one of: SIGNED
  one of: TERMINATED
comment: The current status (signed, ongoing, terminated, etc.) of the project.

published pages
type: DatatypeProperty
domain: Project Publication
range: Literal
comment: The pages of a published result.

published year
type: DatatypeProperty
domain: Project Publication
range: nonNegativeInteger
comment: The year of publication.

publisher
type: DatatypeProperty
domain: Project Publication
range: string
comment: Represents the publishing body of a published result.

rcn
type: DatatypeProperty
type: FunctionalProperty
range: nonNegativeInteger
comment: Internal CORDIS identifier used for the identification of the domain entities (e.g., projects, project results, organisations, funding schemes, etc.). Stands for Resource Control Number.

role label
type: DatatypeProperty
domain: Organisation Role
range: Datatype
  one of: coordinator
  one of: international partner
  one of: participant
  one of: partner
  one of: third party
comment: Title for capturing the role of an organisation.

short form
type: DatatypeProperty
domain: Acronym
range: string
comment: The value of the acronym.

signature date
type: DatatypeProperty
sub property of: date
domain: Project
range: date
comment: The day a grant agreement has been signed.

start date
type: DatatypeProperty
sub property of: date
range: date
comment: The time an entity (e.g. project, grant, etc.) is initialized or starts to take effect.

street address
type: DatatypeProperty
domain: Postal Address
range: Literal
comment: The street name and number of the place or address.

telephone number
type: DatatypeProperty
domain: Contact Point
range: Literal
comment: The telephone number.

termination date
type: DatatypeProperty
sub property of: date
range: date
comment: The termination date of a project.

title
type: DatatypeProperty
range: Literal
comment: The entity’s (e.g. project, work package, etc.) official name or title.

URL
type: DatatypeProperty
range: anyURI
comment: A URL that links internet resources related to a CORDIS entity.

value
type: DatatypeProperty
range: decimal
comment: The value of amount being expressed.

VAT number
type: DatatypeProperty
domain: Organisation
range: string
comment: The unique number that identifies a taxable organisation or non-taxable legal entity that is registered for VAT.

work performed
type: DatatypeProperty
domain: Project Report Summary
range: string
comment: A summary of the work carried out during the development of the project.

Acronym
type: Class
subclass of: Restriction
  on property: definition
  cardinality: 1
subclass of: Restriction
  on property: short form
  cardinality: 1
comment: An abbreviation formed from the initial letters of other words and pronounced as a word. It can refer to any type of entities in the CORDIS conceptual framework, and may be stated explicitly or extracted automatically from text.

Administrative Area
type: Class
subclass of: Restriction
  on property: name
  cardinality: 1
comment: An administrative geographical area that is typically managed by a public body. It can be a country, a region, a municipality, a province, a sub-municipality area, etc.
broad match: AdminUnit
broad match: AdministrativeArea

Book
type: Class
subclass of: Project Publication
comment: A non-serial document that is complete in one volume or a designated finite number of volumes. A book published by a publisher is usually identified by an International Standard Book Number (ISBN), and may be manifested as a physical printed publication on paper bound in a hard or soft cover, or in electronic format as an 'e-book'.
broad match: Book

Book Chapter
type: Class
subclass of: Project Publication
comment: A defined chapter of a book, usually with a separate title or number.
broad match: BookChapter

Conference Paper
type: Class
subclass of: Project Publication
comment: A paper, typically the realization of a research paper reporting original research findings, usually published within a conference proceedings volume.
broad match: ConferencePaper

Contact Point
type: Class
subclass of: Restriction
  on property: fax number
  all values from: string
subclass of: Restriction
  on property: telephone number
  all values from: string
comment: A contact point of an organisation or a person.

Coordinates
type: Class
subclass of: Restriction
  on property: latitude
  cardinality: 1
subclass of: Restriction
  on property: longitude
  cardinality: 1
comment: The geo coordinates for a location of entities that participate in or form part of research projects.
broad match: Geometry

Country
type: Class
subclass of: Administrative Area
subclass of: Restriction
  on property: has EU country code
  max cardinality: 1
comment: A country
broad match: Country

Detected Acronym
type: Class
subclass of: Acronym
disjoint with: Title Acronym
comment: Any acronym that has been detected, automatically or manually, from the description of an entity or from any other form of natural language text.

Exploitable Result
type: Class
subclass of: Result
comment: An exploitable project result, e.g., a patent.
broad match: PatentDocument

For Profit Organisation
type: Class
subclass of: Organisation
comment: A for profit entity
broad match: ForProfitOrganisation

Funding Agency
type: Class
subclass of: Organisation
comment: An organisation that materially administrates funding schemes and disburses related grants. In the context of CORDIS, it represents the various European agencies responsible for funding research projects (e.g. ERC, EASME, REA, etc.).
broad match: FundingAgency

Funding Scheme
type: Class
subclass of: Restriction
  on property: has funding scheme category
  cardinality: 1
subclass of: Restriction
  on property: is implemented by
  cardinality: 1
subclass of: Restriction
  on property: URL
  min cardinality: 1
subclass of: Restriction
  on property: duration
  all values from: nonNegativeInteger
subclass of: Restriction
  on property: title
  all values from: string
subclass of: Restriction
  on property: title
  cardinality: 1
comment: Set of rules and conditions which forms the basis for public funding of European research. In CORDIS, they represent the different legal frameworks (e.g. FP6, FP7, H2020). They can also be used to represent the different calls inside each framework by using the recursive relation “partOfScheme”.
broad match: FundingScheme

Grant
type: Class
subclass of: Restriction
  on property: funds
  min cardinality: 1
subclass of: Restriction
  on property: has beneficiary
  min cardinality: 1
subclass of: Restriction
  on property: has funding scheme
  min cardinality: 1
subclass of: Restriction
  on property: has payment
  min cardinality: 1
subclass of: Restriction
  on property: has funding amount
  cardinality: 1
subclass of: Restriction
  on property: is disbursed by
  cardinality: 1
subclass of: Restriction
  on property: duration
  some values from: nonNegativeInteger
subclass of: Restriction
  on property: end date
  cardinality: 1
subclass of: Restriction
  on property: identifier
  cardinality: 1
subclass of: Restriction
  on property: start date
  cardinality: 1
comment: A disbursed fund paid to a recipient or beneficiary within the context of a funded research project. In the context of CORDIS, it represents a grant of a specific EU programme (e.g. an H2020 grant).
broad match: Grant

Grant Payment
type: Class
subclass of: Restriction
  on property: has payment amount
  cardinality: 1
comment: A single payment to a recipient or beneficiary of a Grant within a research project.
broad match: GrantPayment

Higher Or Secondary Education
type: Class
subclass of: Organisation
comment: Institution that provides education.
broad match: EducationalOrganization
broad match: EducationOrganisation

Journal Paper
type: Class
subclass of: Project Publication
comment: An article, typically the realization of a research paper reporting original research findings, published in a journal issue.
broad match: JournalArticle

Monetary Amount
type: Class
subclass of: Restriction
  on property: is net
  max cardinality: 1
subclass of: Restriction
  on property: value
  cardinality: 1
comment: A monetary value or range. This type can be used to describe an amount of money such as $50 USD, or a range as in describing a bank account being suitable for a balance between £1,000 and £1,000,000 GBP, or the value of a salary, etc.
broad match: MonetaryAmount

Non Peer-Reviewed Publication
type: Class
subclass of: Project Publication
comment: A work that hasn't undergone peer reviewing prior to its publication.

Organisation
type: Class
subclass of: Restriction
  on property: has role
  all values from: Organisation Role
subclass of: Restriction
  on property: has site
  min cardinality: 1
subclass of: Restriction
  on property: URL
  max cardinality: 1
subclass of: Restriction
  on property: identifier
  cardinality: 1
subclass of: Restriction
  on property: legal name
  cardinality: 1
subclass of: Restriction
  on property: rcn
  cardinality: 1
subclass of: Restriction
  on property: VAT number
  cardinality: 1
disjoint with: Person
comment: Represents a group of people, with the same purpose, organized together into a community or other social, commercial or political structure that participate in CORDIS projects.
broad match: Organization
broad match: Organisation

Organisation Role
type: Class
subclass of: Role
subclass of: Restriction
  on property: is role of
  all values from: Organisation
subclass of: Restriction
  on property: is role of
  cardinality: 1
disjoint with: Person Role
comment: Function assumed by or ascribed to an organisation that takes part in a particular project. In CORDIs, it represents roles such as coordinator, partner, consortium member, etc.
broad match: OrganisationRole

Organisation Unit
type: Class
comment: A department or unit which is part of some larger Organization and only has full recognition within the context of that Organization. In CORDIS, it represents for instance the different departments of a university that participate in a particular project.
broad match: OrganizationalUnit

Person
type: Class
subclass of: Restriction
  on property: has role
  all values from: Person Role
subclass of: Restriction
  on property: additional name
  max cardinality: 1
subclass of: Restriction
  on property: family name
  cardinality: 1
subclass of: Restriction
  on property: given name
  cardinality: 1
disjoint with: Person Role
comment: A physical person. In CORDIS, it represents the different people assuming roles in research projects (e.g. PhD students, PIs, administrative contacts, etc.).
broad match: Person

Person Role
type: Class
subclass of: Role
subclass of: Restriction
  on property: is role of
  all values from: Person
subclass of: Restriction
  on property: is role of
  cardinality: 1
subclass of: Restriction
  on property: is employed by
  max cardinality: 1
comment: Function assumed by or ascribed to a person that takes part in a particular project. In CORDIS, it represents roles such as contact person, PI, etc.
broad match: PersonRole

Postal Address
type: Class
subclass of: Restriction
  on property: address country
  cardinality: 1
subclass of: Restriction
  on property: address locality
  cardinality: 1
subclass of: Restriction
  on property: full address
  all values from: string
subclass of: Restriction
  on property: full address
  cardinality: 1
subclass of: Restriction
  on property: postal code
  all values from: string
subclass of: Restriction
  on property: postal code
  cardinality: 1
subclass of: Restriction
  on property: street address
  all values from: string
subclass of: Restriction
  on property: street address
  cardinality: 1
comment: The postal address of entities that participate in or form part of research projects.
broad match: PostalAddress
broad match: Address

Project
type: Class
subclass of: Restriction
  on property: has involved party
  min cardinality: 1
subclass of: Restriction
  on property: is funded by
  min cardinality: 1
subclass of: Restriction
  on property: has total cost
  cardinality: 1
subclass of: Restriction
  on property: URL
  max cardinality: 1
subclass of: Restriction
  on property: abstract
  cardinality: 1
subclass of: Restriction
  on property: duration
  cardinality: 1
subclass of: Restriction
  on property: end date
  cardinality: 1
subclass of: Restriction
  on property: identifier
  cardinality: 1
subclass of: Restriction
  on property: project status
  cardinality: 1
subclass of: Restriction
  on property: rcn
  cardinality: 1
subclass of: Restriction
  on property: signature date
  cardinality: 1
subclass of: Restriction
  on property: start date
  cardinality: 1
subclass of: Restriction
  on property: title
  all values from: string
subclass of: Restriction
  on property: title
  cardinality: 1
comment: A planned research work that has one or more objectives (divided or not into tasks) and is conducted by one or more organisations. In CORDIS, it represents a project funded by an EU programme.
broad match: Project

Project Deliverable
type: Class
subclass of: Result
subclass of: Restriction
  on property: has result type
  cardinality: 1
subclass of: Restriction
  on property: description
  max cardinality: 1
comment: A document referring to the results obtained during the development of a project.
broad match: ProjectReportDocument

Project Publication
type: Class
subclass of: Result
subclass of: Restriction
  on property: author list
  cardinality: 1
subclass of: Restriction
  on property: journal number
  all values from: string
subclass of: Restriction
  on property: journal number
  cardinality: 1
subclass of: Restriction
  on property: journal title
  cardinality: 1
subclass of: Restriction
  on property: published pages
  all values from: string
subclass of: Restriction
  on property: published pages
  max cardinality: 1
subclass of: Restriction
  on property: published year
  cardinality: 1
subclass of: Restriction
  on property: publisher
  cardinality: 1
comment: A scientific publication (e.g., journal article, conference paper, thesis dissertation, book, etc.) that resulted from the project activities.
broad match: Expression

Project Report Summary
type: Class
subclass of: Result
subclass of: Restriction
  on property: abstract
  cardinality: 1
subclass of: Restriction
  on property: end date
  max cardinality: 1
subclass of: Restriction
  on property: final results
  max cardinality: 1
subclass of: Restriction
  on property: start date
  max cardinality: 1
subclass of: Restriction
  on property: work performed
  max cardinality: 1
comment: A document reporting on the progress of an on-going or completed project at a given period..
broad match: ProjectReportSummary

Public Body
type: Class
subclass of: Organisation
comment: Organisation or agency depending on a government, State or other supranational organisation and mainly operated by the government.

Research Organisation
type: Class
subclass of: Organisation
comment: Organisations devoted to research activities.
broad match: ResearchPerformingOrganisation

Result
type: Class
subclass of: Restriction
  on property: URL
  max cardinality: 1
subclass of: Restriction
  on property: title
  all values from: string
subclass of: Restriction
  on property: title
  cardinality: 1
comment: Any tangible or intangible output of the project (such as data, knowledge and information, whatever their form or nature, whether or not they can be protected), which are generated in the project.

Role
type: Class
subclass of: Restriction
  on property: is involved in
  cardinality: 1
subclass of: Restriction
  on property: end date
  cardinality: 1
subclass of: Restriction
  on property: role label
  cardinality: 1
subclass of: Restriction
  on property: start date
  cardinality: 1
comment: The function assumed by or ascribed to an entity (typically a person or organisation) in a particular project. It can be used to precise or represent additional information about a relationship or property such as participation or membership. In CORDIS, it represents the participation of a person or organisation in a research project.
broad match: Role

SME
type: Class
subclass of: Organisation
comment: Small and Medium Enterprises.
broad match: SME

Site
type: Class
subclass of: Restriction
  on property: has geographical location
  min cardinality: 1
subclass of: Restriction
  on property: is site of
  cardinality: 1
subclass of: Restriction
  on property: has address
  cardinality: 1
subclass of: Restriction
  on property: has coordinates
  cardinality: 1
subclass of: Restriction
  on property: name
  cardinality: 1
comment: The physical extension of entities that participate in or form part of research projects.
broad match: Site

Thesis
type: Class
subclass of: Project Publication
comment: A book authored by a student containing a formal presentations of research outputs submitted for examination in completion of a course of study at an institution of higher education, to fulfil the requirements for an academic degree. Also know as a dissertation.
broad match: Thesis

Title Acronym
type: Class
subclass of: Acronym
comment: An acronym explicitly defined as the title or name of another entity (e.g. Project, Organisation, Funding Scheme, etc.).

Workshop Paper
type: Class
subclass of: Project Publication
comment: A paper, typically the realization of a research paper reporting original research findings, usually presented at a workshop and published within a workshop proceedings volume.
broad match: WorkshopPaper